{"text_format":"3","workbook":"xlsx","n_sheets":16,"sheets":["Skupina_mix_A","Skupina_mix_B","Pavúk_6","Pavúk_7","Pavúk_8","Pavúk9","Pavúk_10","Pavúky_11","Pavúk_12","pavúk_16","Pavúk_17","Pavuk_18","Pavuk_23","pavúk_32","pavúk_64","Skupina_4"],"read":"whole","date_system":"1900"}

{"sheet":"Skupina_mix_A","index":0,"n_rows":24,"n_cols":28,"rows_kept":24,"merged":[[1,1,1,21],[3,2,3,4],[3,5,3,7],[3,8,3,10],[3,11,3,13],[3,14,3,16],[3,17,3,19],[4,2,4,4],[5,5,5,7],[6,8,6,10],[7,11,7,13],[8,14,8,16],[12,1,12,14],[14,1,14,4],[14,8,14,14],[15,1,15,4],[15,8,15,14],[16,1,16,4],[16,8,16,14],[17,1,17,4],[17,8,17,14],[18,1,18,4],[18,8,18,14],[19,1,19,4],[19,8,19,14],[20,1,20,4],[20,8,20,14],[21,1,21,4],[21,8,21,14],[22,1,22,4],[22,8,22,14],[23,1,23,4],[23,8,23,14]]}
[]
[null,{"$f":"B1","v":0}]
[]
[null,null,"Hrušecká",null,null,"Slagter.S",null,null,"Erentová",null,null,"Sasková",null,null,"Jelínek",null,null,"Skóre",null,null,"Body","Poradie"]
[null,"Hrušecká",{"$f":"B1","v":0},null,null,2,{"$f":"IF(ISBLANK(F5),\" \",\":\")","v":":"},0,2,{"$f":"IF(ISBLANK(I5),\" \",\":\")","v":":"},0,2,{"$f":"IF(ISBLANK(L5),\" \",\":\")","v":":"},0,2,{"$f":"IF(ISBLANK(O5),\" \",\":\")","v":":"},0,{"$f":"F5+I5+L5+O5","v":8},{"$f":"IF(ISBLANK(R5),\" \",\":\")","v":":"},{"$f":"H5+K5+N5+Q5","v":0},{"$f":"SUM(X5:AB5)","v":4},1,null,null,{"$f":"IF(F5>H5,1,0)","v":1},{"$f":"IF(I5>K5,1,0)","v":1},{"$f":"IF(L5>N5,1,0)","v":1},{"$f":"IF(O5>Q5,1,0)","v":1}]
[null,"Slagter.S",{"$f":"IF(ISBLANK(H5),0,H5)","v":0},{"$f":"IF(ISBLANK(C6),\" \",\":\")","v":":"},{"$f":"IF(ISBLANK(F5),0,F5)","v":2},{"$f":"C5","v":0},null,null,2,{"$f":"IF(ISBLANK(I6),\" \",\":\")","v":":"},0,2,{"$f":"IF(ISBLANK(L6),\" \",\":\")","v":":"},0,2,{"$f":"IF(ISBLANK(O6),\" \",\":\")","v":":"},0,{"$f":"C6+I6+L6+O6","v":6},{"$f":"IF(ISBLANK(R6),\" \",\":\")","v":":"},{"$f":"E6+K6+N6+Q6","v":2},{"$f":"SUM(X6:AB6)","v":3},3,null,{"$f":"IF(C6>E6,1,0)","v":0},null,{"$f":"IF(I6>K6,1,0)","v":1},{"$f":"IF(L6>N6,1,0)","v":1},{"$f":"IF(O6>Q6,1,0)","v":1}]
[null,"Erentová",{"$f":"IF(ISBLANK(K5),0,K5)","v":0},{"$f":"IF(ISBLANK(C7),\" \",\":\")","v":":"},{"$f":"IF(ISBLANK(I5),0,I5)","v":2},{"$f":"IF(ISBLANK(K6),0,K6)","v":0},{"$f":"IF(ISBLANK(F7),\" \",\":\")","v":":"},{"$f":"IF(ISBLANK(I6),0,I6)","v":2},{"$f":"F6","v":0},null,null,2,{"$f":"IF(ISBLANK(L7),\" \",\":\")","v":":"},0,2,{"$f":"IF(ISBLANK(O7),\" \",\":\")","v":":"},0,{"$f":"C7+F7+L7+O7","v":4},{"$f":"IF(ISBLANK(R7),\" \",\":\")","v":":"},{"$f":"E7+H7+N7+Q7","v":4},{"$f":"SUM(X7:AB7)","v":2},6,null,{"$f":"IF(C7>E7,1,0)","v":0},{"$f":"IF(F7>H7,1,0)","v":0},null,{"$f":"IF(L7>N7,1,0)","v":1},{"$f":"IF(O7>Q7,1,0)","v":1}]
[null,"Sasková",{"$f":"IF(ISBLANK(N5),0,N5)","v":0},{"$f":"IF(ISBLANK(C8),\" \",\":\")","v":":"},{"$f":"IF(ISBLANK(L5),0,L5)","v":2},{"$f":"IF(ISBLANK(N6),0,N6)","v":0},{"$f":"IF(ISBLANK(F8),\" \",\":\")","v":":"},{"$f":"IF(ISBLANK(L6),0,L6)","v":2},{"$f":"IF(ISBLANK(N7),0,N7)","v":0},{"$f":"IF(ISBLANK(I8),\" \",\":\")","v":":"},{"$f":"IF(ISBLANK(L7),0,L7)","v":2},{"$f":"I7","v":0},null,null,0,{"$f":"IF(ISBLANK(O8),\" \",\":\")","v":":"},2,{"$f":"C8+F8+I8+O8","v":0},{"$f":"IF(ISBLANK(R8),\" \",\":\")","v":":"},{"$f":"E8+H8+K8+Q8","v":8},{"$f":"SUM(X8:AB8)","v":0},9,null,{"$f":"IF(C8>E8,1,0)","v":0},{"$f":"IF(F8>H8,1,0)","v":0},{"$f":"IF(I8>K8,1,0)","v":0},null,{"$f":"IF(O8>Q8,1,0)","v":0}]
[null,"Jelínek",{"$f":"IF(ISBLANK(Q5),0,Q5)","v":0},{"$f":"IF(ISBLANK(C9),\" \",\":\")","v":":"},{"$f":"IF(ISBLANK(O5),0,O5)","v":2},{"$f":"IF(ISBLANK(Q6),0,Q6)","v":0},{"$f":"IF(ISBLANK(F9),\" \",\":\")","v":":"},{"$f":"IF(ISBLANK(O6),0,O6)","v":2},{"$f":"IF(ISBLANK(Q7),0,Q7)","v":0},{"$f":"IF(ISBLANK(I9),\" \",\":\")","v":":"},{"$f":"IF(ISBLANK(O7),0,O7)","v":2},{"$f":"IF(ISBLANK(Q8),0,Q8)","v":2},{"$f":"IF(ISBLANK(L9),\" \",\":\")","v":":"},{"$f":"IF(ISBLANK(O8),0,O8)","v":0},{"$f":"L8","v":0},null,null,{"$f":"C9+F9+I9+L9","v":2},{"$f":"IF(ISBLANK(R9),\" \",\":\")","v":":"},{"$f":"E9+H9+K9+N9","v":6},{"$f":"SUM(X9:AB9)","v":1},7,null,{"$f":"IF(C9>E9,1,0)","v":0},{"$f":"IF(F9>H9,1,0)","v":0},{"$f":"IF(I9>K9,1,0)","v":0},{"$f":"IF(L9>N9,1,0)","v":1}]
[]
[]
[]
[null,"Poradie zápasov"]
[]
[null,{"$f":"C4","v":"Hrušecká"},{"$nulls":3},"-",null,null,{"$f":"I4","v":"Erentová"}]
[null,{"$f":"F4","v":"Slagter.S"},{"$nulls":3},"-",null,null,{"$f":"L4","v":"Sasková"}]
[null,{"$f":"O4","v":"Jelínek"},{"$nulls":3},"-",null,null,{"$f":"C4","v":"Hrušecká"}]
[null,{"$f":"F4","v":"Slagter.S"},{"$nulls":3},"-",null,null,{"$f":"I4","v":"Erentová"}]
[null,{"$f":"L4","v":"Sasková"},{"$nulls":3},"-",null,null,{"$f":"O4","v":"Jelínek"}]
[null,{"$f":"C4","v":"Hrušecká"},{"$nulls":3},"-",null,null,{"$f":"F4","v":"Slagter.S"}]
[null,{"$f":"I4","v":"Erentová"},{"$nulls":3},"-",null,null,{"$f":"L4","v":"Sasková"}]
[null,{"$f":"F4","v":"Slagter.S"},{"$nulls":3},"-",null,null,{"$f":"O4","v":"Jelínek"}]
[null,{"$f":"C4","v":"Hrušecká"},{"$nulls":3},"-",null,null,{"$f":"L4","v":"Sasková"}]
[null,{"$f":"I4","v":"Erentová"},{"$nulls":3},"-",null,null,{"$f":"O4","v":"Jelínek"}]

{"sheet":"Skupina_mix_B","index":1,"n_rows":24,"n_cols":28,"rows_kept":24,"merged":[[1,1,1,21],[3,2,3,4],[3,5,3,7],[3,8,3,10],[3,11,3,13],[3,14,3,16],[3,17,3,19],[4,2,4,4],[5,5,5,7],[6,8,6,10],[7,11,7,13],[8,14,8,16],[12,1,12,14],[14,1,14,4],[14,8,14,14],[15,1,15,4],[15,8,15,14],[16,1,16,4],[16,8,16,14],[17,1,17,4],[17,8,17,14],[18,1,18,4],[18,8,18,14],[19,1,19,4],[19,8,19,14],[20,1,20,4],[20,8,20,14],[21,1,21,4],[21,8,21,14],[22,1,22,4],[22,8,22,14],[23,1,23,4],[23,8,23,14]]}
[]
[null,{"$f":"B1","v":0}]
[]
[null,null,"Pravdová",null,null,"Pavlíková",null,null,"Slagter.L",null,null,"Slagter.P",null,null,"Záhradníček",null,null,"Skóre",null,null,"Body","Poradie"]
[null,"Pravdová",{"$f":"B1","v":0},null,null,2,{"$f":"IF(ISBLANK(F5),\" \",\":\")","v":":"},0,2,{"$f":"IF(ISBLANK(I5),\" \",\":\")","v":":"},0,0,{"$f":"IF(ISBLANK(L5),\" \",\":\")","v":":"},2,2,{"$f":"IF(ISBLANK(O5),\" \",\":\")","v":":"},0,{"$f":"F5+I5+L5+O5","v":6},{"$f":"IF(ISBLANK(R5),\" \",\":\")","v":":"},{"$f":"H5+K5+N5+Q5","v":2},{"$f":"SUM(X5:AB5)","v":3},4,null,null,{"$f":"IF(F5>H5,1,0)","v":1},{"$f":"IF(I5>K5,1,0)","v":1},{"$f":"IF(L5>N5,1,0)","v":0},{"$f":"IF(O5>Q5,1,0)","v":1}]
[null,"Pavlíková",{"$f":"IF(ISBLANK(H5),0,H5)","v":0},{"$f":"IF(ISBLANK(C6),\" \",\":\")","v":":"},{"$f":"IF(ISBLANK(F5),0,F5)","v":2},{"$f":"C5","v":0},null,null,0,{"$f":"IF(ISBLANK(I6),\" \",\":\")","v":":"},2,0,{"$f":"IF(ISBLANK(L6),\" \",\":\")","v":":"},2,2,{"$f":"IF(ISBLANK(O6),\" \",\":\")","v":":"},0,{"$f":"C6+I6+L6+O6","v":2},{"$f":"IF(ISBLANK(R6),\" \",\":\")","v":":"},{"$f":"E6+K6+N6+Q6","v":6},{"$f":"SUM(X6:AB6)","v":1},8,null,{"$f":"IF(C6>E6,1,0)","v":0},null,{"$f":"IF(I6>K6,1,0)","v":0},{"$f":"IF(L6>N6,1,0)","v":0},{"$f":"IF(O6>Q6,1,0)","v":1}]
[null,"Slagter.L",{"$f":"IF(ISBLANK(K5),0,K5)","v":0},{"$f":"IF(ISBLANK(C7),\" \",\":\")","v":":"},{"$f":"IF(ISBLANK(I5),0,I5)","v":2},{"$f":"IF(ISBLANK(K6),0,K6)","v":2},{"$f":"IF(ISBLANK(F7),\" \",\":\")","v":":"},{"$f":"IF(ISBLANK(I6),0,I6)","v":0},{"$f":"F6","v":0},null,null,0,{"$f":"IF(ISBLANK(L7),\" \",\":\")","v":":"},2,2,{"$f":"IF(ISBLANK(O7),\" \",\":\")","v":":"},0,{"$f":"C7+F7+L7+O7","v":4},{"$f":"IF(ISBLANK(R7),\" \",\":\")","v":":"},{"$f":"E7+H7+N7+Q7","v":4},{"$f":"SUM(X7:AB7)","v":2},5,null,{"$f":"IF(C7>E7,1,0)","v":0},{"$f":"IF(F7>H7,1,0)","v":1},null,{"$f":"IF(L7>N7,1,0)","v":0},{"$f":"IF(O7>Q7,1,0)","v":1}]
[null,"Slagter.P",{"$f":"IF(ISBLANK(N5),0,N5)","v":2},{"$f":"IF(ISBLANK(C8),\" \",\":\")","v":":"},{"$f":"IF(ISBLANK(L5),0,L5)","v":0},{"$f":"IF(ISBLANK(N6),0,N6)","v":2},{"$f":"IF(ISBLANK(F8),\" \",\":\")","v":":"},{"$f":"IF(ISBLANK(L6),0,L6)","v":0},{"$f":"IF(ISBLANK(N7),0,N7)","v":2},{"$f":"IF(ISBLANK(I8),\" \",\":\")","v":":"},{"$f":"IF(ISBLANK(L7),0,L7)","v":0},{"$f":"I7","v":0},null,null,2,{"$f":"IF(ISBLANK(O8),\" \",\":\")","v":":"},0,{"$f":"C8+F8+I8+O8","v":8},{"$f":"IF(ISBLANK(R8),\" \",\":\")","v":":"},{"$f":"E8+H8+K8+Q8","v":0},{"$f":"SUM(X8:AB8)","v":4},2,null,{"$f":"IF(C8>E8,1,0)","v":1},{"$f":"IF(F8>H8,1,0)","v":1},{"$f":"IF(I8>K8,1,0)","v":1},null,{"$f":"IF(O8>Q8,1,0)","v":1}]
[null,"Záhradníček",{"$f":"IF(ISBLANK(Q5),0,Q5)","v":0},{"$f":"IF(ISBLANK(C9),\" \",\":\")","v":":"},{"$f":"IF(ISBLANK(O5),0,O5)","v":2},{"$f":"IF(ISBLANK(Q6),0,Q6)","v":0},{"$f":"IF(ISBLANK(F9),\" \",\":\")","v":":"},{"$f":"IF(ISBLANK(O6),0,O6)","v":2},{"$f":"IF(ISBLANK(Q7),0,Q7)","v":0},{"$f":"IF(ISBLANK(I9),\" \",\":\")","v":":"},{"$f":"IF(ISBLANK(O7),0,O7)","v":2},{"$f":"IF(ISBLANK(Q8),0,Q8)","v":0},{"$f":"IF(ISBLANK(L9),\" \",\":\")","v":":"},{"$f":"IF(ISBLANK(O8),0,O8)","v":2},{"$f":"L8","v":0},null,null,{"$f":"C9+F9+I9+L9","v":0},{"$f":"IF(ISBLANK(R9),\" \",\":\")","v":":"},{"$f":"E9+H9+K9+N9","v":8},{"$f":"SUM(X9:AB9)","v":0},10,null,{"$f":"IF(C9>E9,1,0)","v":0},{"$f":"IF(F9>H9,1,0)","v":0},{"$f":"IF(I9>K9,1,0)","v":0},{"$f":"IF(L9>N9,1,0)","v":0}]
[]
[]
[]
[null,"Poradie zápasov"]
[]
[null,{"$f":"C4","v":"Pravdová"},{"$nulls":3},"-",null,null,{"$f":"I4","v":"Slagter.L"}]
[null,{"$f":"F4","v":"Pavlíková"},{"$nulls":3},"-",null,null,{"$f":"L4","v":"Slagter.P"}]
[null,{"$f":"O4","v":"Záhradníček"},{"$nulls":3},"-",null,null,{"$f":"C4","v":"Pravdová"}]
[null,{"$f":"F4","v":"Pavlíková"},{"$nulls":3},"-",null,null,{"$f":"I4","v":"Slagter.L"}]
[null,{"$f":"L4","v":"Slagter.P"},{"$nulls":3},"-",null,null,{"$f":"O4","v":"Záhradníček"}]
[null,{"$f":"C4","v":"Pravdová"},{"$nulls":3},"-",null,null,{"$f":"F4","v":"Pavlíková"}]
[null,{"$f":"I4","v":"Slagter.L"},{"$nulls":3},"-",null,null,{"$f":"L4","v":"Slagter.P"}]
[null,{"$f":"F4","v":"Pavlíková"},{"$nulls":3},"-",null,null,{"$f":"O4","v":"Záhradníček"}]
[null,{"$f":"C4","v":"Pravdová"},{"$nulls":3},"-",null,null,{"$f":"L4","v":"Slagter.P"}]
[null,{"$f":"I4","v":"Slagter.L"},{"$nulls":3},"-",null,null,{"$f":"O4","v":"Záhradníček"}]

{"sheet":"Pavúk_6","index":2,"n_rows":38,"n_cols":28,"rows_kept":38,"hidden":true,"merged":[[1,1,1,21],[3,2,3,4],[3,5,3,7],[3,8,3,10],[3,11,3,13],[3,14,3,16],[3,17,3,19],[4,2,4,4],[5,5,5,7],[6,8,6,10],[9,1,9,21],[11,2,11,4],[11,5,11,7],[11,8,11,10],[11,11,11,13],[11,14,11,16],[11,17,11,19],[12,2,12,4],[13,5,13,7],[14,8,14,10],[16,1,16,14],[18,1,18,4],[18,6,18,17],[19,1,19,4],[19,6,19,17],[20,1,20,4],[20,6,20,17],[21,1,21,4],[21,6,21,17],[22,1,22,4],[22,6,22,17],[23,1,23,4],[23,6,23,17],[24,1,24,4],[24,8,24,14],[26,1,26,14],[27,1,27,4],[27,8,27,14],[29,1,29,11],[30,1,30,4],[30,8,30,14],[31,1,31,4],[31,8,31,14],[33,1,33,11],[34,1,34,4],[34,8,34,14],[36,1,36,11],[37,1,37,4],[37,8,37,14]]}
[]
[null,"SKUPINA A"]
[]
[null,{"$f":"B1","v":0},{"$nulls":15},"Skóre",null,null,"Body","Poradie"]
[null,{"$f":"C4","v":0},{"$f":"B2","v":"SKUPINA A"},{"$nulls":3},{"$f":"IF(ISBLANK(F5),\" \",\":\")","v":" "},null,null,{"$f":"IF(ISBLANK(I5),\" \",\":\")","v":" "},null,null,{"$f":"IF(ISBLANK(L5),\" \",\":\")","v":" "},null,null,{"$f":"IF(ISBLANK(O5),\" \",\":\")","v":" "},null,{"$f":"F5+I5+L5+O5","v":0},{"$f":"IF(ISBLANK(R5),\" \",\":\")","v":":"},{"$f":"H5+K5+N5+Q5","v":0},{"$f":"SUM(X5:AB5)","v":0},{"$nulls":3},{"$f":"IF(F5>H5,1,0)","v":0},{"$f":"IF(I5>K5,1,0)","v":0},{"$f":"IF(L5>N5,1,0)","v":0},{"$f":"IF(O5>Q5,1,0)","v":0}]
[null,{"$f":"F4","v":0},{"$f":"IF(ISBLANK(H5),0,H5)","v":0},{"$f":"IF(ISBLANK(C6),\" \",\":\")","v":":"},{"$f":"IF(ISBLANK(F5),0,F5)","v":0},{"$f":"C5","v":"SKUPINA A"},{"$nulls":3},{"$f":"IF(ISBLANK(I6),\" \",\":\")","v":" "},null,null,{"$f":"IF(ISBLANK(L6),\" \",\":\")","v":" "},null,null,{"$f":"IF(ISBLANK(O6),\" \",\":\")","v":" "},null,{"$f":"C6+I6+L6+O6","v":0},{"$f":"IF(ISBLANK(R6),\" \",\":\")","v":":"},{"$f":"E6+K6+N6+Q6","v":0},{"$f":"SUM(X6:AB6)","v":0},null,null,{"$f":"IF(C6>E6,1,0)","v":0},null,{"$f":"IF(I6>K6,1,0)","v":0},{"$f":"IF(L6>N6,1,0)","v":0},{"$f":"IF(O6>Q6,1,0)","v":0}]
[null,{"$f":"I4","v":0},{"$f":"IF(ISBLANK(K5),0,K5)","v":0},{"$f":"IF(ISBLANK(C7),\" \",\":\")","v":":"},{"$f":"IF(ISBLANK(I5),0,I5)","v":0},{"$f":"IF(ISBLANK(K6),0,K6)","v":0},{"$f":"IF(ISBLANK(F7),\" \",\":\")","v":":"},{"$f":"IF(ISBLANK(I6),0,I6)","v":0},{"$f":"C5","v":"SKUPINA A"},{"$nulls":3},{"$f":"IF(ISBLANK(L7),\" \",\":\")","v":" "},null,null,{"$f":"IF(ISBLANK(O7),\" \",\":\")","v":" "},null,{"$f":"C7+F7+L7+O7","v":0},{"$f":"IF(ISBLANK(R7),\" \",\":\")","v":":"},{"$f":"E7+H7+N7+Q7","v":0},{"$f":"SUM(X7:AB7)","v":0},null,null,{"$f":"IF(C7>E7,1,0)","v":0},{"$f":"IF(F7>H7,1,0)","v":0},null,{"$f":"IF(L7>N7,1,0)","v":0},{"$f":"IF(O7>Q7,1,0)","v":0}]
[]
[]
[null,"SKUPINA B"]
[]
[null,{"$f":"B4","v":0},{"$nulls":15},"Skóre",null,null,"Body","Poradie"]
[null,{"$f":"C12","v":0},{"$f":"B10","v":"SKUPINA B"},{"$nulls":3},{"$f":"IF(ISBLANK(F13),\" \",\":\")","v":" "},null,null,{"$f":"IF(ISBLANK(I13),\" \",\":\")","v":" "},null,null,{"$f":"IF(ISBLANK(L13),\" \",\":\")","v":" "},null,null,{"$f":"IF(ISBLANK(O13),\" \",\":\")","v":" "},null,{"$f":"F13+I13+L13+O13","v":0},{"$f":"IF(ISBLANK(R13),\" \",\":\")","v":":"},{"$f":"H13+K13+N13+Q13","v":0},{"$f":"SUM(X13:AB13)","v":0},{"$nulls":3},{"$f":"IF(F13>H13,1,0)","v":0},{"$f":"IF(I13>K13,1,0)","v":0},{"$f":"IF(L13>N13,1,0)","v":0},{"$f":"IF(O13>Q13,1,0)","v":0}]
[null,{"$f":"F12","v":0},{"$f":"IF(ISBLANK(H13),0,H13)","v":0},{"$f":"IF(ISBLANK(C14),\" \",\":\")","v":":"},{"$f":"IF(ISBLANK(F13),0,F13)","v":0},{"$f":"C13","v":"SKUPINA B"},{"$nulls":3},{"$f":"IF(ISBLANK(I14),\" \",\":\")","v":" "},null,null,{"$f":"IF(ISBLANK(L14),\" \",\":\")","v":" "},null,null,{"$f":"IF(ISBLANK(O14),\" \",\":\")","v":" "},null,{"$f":"C14+I14+L14+O14","v":0},{"$f":"IF(ISBLANK(R14),\" \",\":\")","v":":"},{"$f":"E14+K14+N14+Q14","v":0},{"$f":"SUM(X14:AB14)","v":0},null,null,{"$f":"IF(C14>E14,1,0)","v":0},null,{"$f":"IF(I14>K14,1,0)","v":0},{"$f":"IF(L14>N14,1,0)","v":0},{"$f":"IF(O14>Q14,1,0)","v":0}]
[null,{"$f":"I12","v":0},{"$f":"IF(ISBLANK(K13),0,K13)","v":0},{"$f":"IF(ISBLANK(C15),\" \",\":\")","v":":"},{"$f":"IF(ISBLANK(I13),0,I13)","v":0},{"$f":"IF(ISBLANK(K14),0,K14)","v":0},{"$f":"IF(ISBLANK(F15),\" \",\":\")","v":":"},{"$f":"IF(ISBLANK(I14),0,I14)","v":0},{"$f":"C13","v":"SKUPINA B"},{"$nulls":3},{"$f":"IF(ISBLANK(L15),\" \",\":\")","v":" "},null,null,{"$f":"IF(ISBLANK(O15),\" \",\":\")","v":" "},null,{"$f":"C15+F15+L15+O15","v":0},{"$f":"IF(ISBLANK(R15),\" \",\":\")","v":":"},{"$f":"E15+H15+N15+Q15","v":0},{"$f":"SUM(X15:AB15)","v":0},null,null,{"$f":"IF(C15>E15,1,0)","v":0},{"$f":"IF(F15>H15,1,0)","v":0},null,{"$f":"IF(L15>N15,1,0)","v":0},{"$f":"IF(O15>Q15,1,0)","v":0}]
[]
[null,"Poradie zápasov"]
[]
[null,{"$f":"C4","v":0},{"$nulls":3},"-",{"$f":"I4","v":0}]
[null,{"$f":"C12","v":0},{"$nulls":3},"-",{"$f":"I12","v":0}]
[null,{"$f":"F4","v":0},{"$nulls":3},"-",{"$f":"I4","v":0}]
[null,{"$f":"F12","v":0},{"$nulls":3},"-",{"$f":"I12","v":0}]
[null,{"$f":"C4","v":0},{"$nulls":3},"-",{"$f":"F4","v":0}]
[null,{"$f":"C12","v":0},{"$nulls":3},"-",{"$f":"F12","v":0}]
[]
[]
[null,"O 5-6.miesto"]
[null,"GROUP A-1",{"$nulls":3},"-",null,null,"GROUP B-2"]
[]
[null,"SEMIFINÁLE"]
[null,"GROUP A-1",{"$nulls":3},"-",null,null,"GROUP B-2"]
[null,"GROUP A-2",{"$nulls":3},"-",null,null,"GROUP B-1"]
[]
[null,"Finále"]
[null,"Winner sem1",{"$nulls":3},"-",null,null,"Winner sem2"]
[]
[null,"O 3.miesto"]
[null,"Loser sem1",{"$nulls":3},"-",null,null,"Loser sem2"]

{"sheet":"Pavúk_7","index":3,"n_rows":50,"n_cols":28,"rows_kept":50,"hidden":true,"merged":[[1,1,1,21],[2,7,2,11],[4,2,4,4],[4,5,4,7],[4,8,4,10],[4,11,4,13],[4,14,4,16],[4,17,4,19],[5,2,5,4],[6,5,6,7],[7,8,7,10],[8,11,8,13],[11,7,11,11],[13,2,13,4],[13,5,13,7],[13,8,13,10],[13,11,13,13],[13,14,13,16],[13,17,13,19],[14,2,14,4],[15,5,15,7],[16,8,16,10],[19,1,19,14],[21,1,21,4],[21,8,21,14],[22,1,22,4],[22,8,22,14],[23,1,23,4],[23,8,23,14],[24,1,24,4],[24,8,24,14],[25,1,25,4],[25,8,25,14],[26,1,26,4],[26,8,26,14],[27,1,27,4],[27,8,27,14],[28,1,28,4],[28,8,28,14],[29,1,29,4],[29,8,29,14],[30,1,30,4],[30,8,30,14],[31,2,31,4],[31,5,31,7],[31,8,31,10],[31,11,31,13],[31,14,31,16],[31,17,31,19],[32,2,32,4],[33,5,33,7],[34,8,34,10],[36,1,36,14],[38,1,38,4],[38,8,38,14],[39,1,39,4],[39,8,39,14],[41,1,41,11],[42,1,42,4],[42,8,42,14],[43,1,43,4],[43,8,43,14],[45,1,45,11],[46,1,46,4],[46,8,46,14],[48,1,48,11],[49,1,49,4],[49,8,49,14]]}
[]
[null,{"$f":"B1","v":0}]
[{"$nulls":7},"SKUPINA A"]
[]
[{"$nulls":17},"Skóre",null,null,"Body","Poradie"]
[null,{"$f":"C5","v":0},{"$f":"B2","v":0},{"$nulls":3},{"$f":"IF(ISBLANK(F6),\" \",\":\")","v":" "},null,null,{"$f":"IF(ISBLANK(I6),\" \",\":\")","v":" "},null,null,{"$f":"IF(ISBLANK(L6),\" \",\":\")","v":" "},null,null,{"$f":"IF(ISBLANK(O6),\" \",\":\")","v":" "},null,{"$f":"F6+I6+L6+O6","v":0},{"$f":"IF(ISBLANK(R6),\" \",\":\")","v":":"},{"$f":"H6+K6+N6+Q6","v":0},{"$f":"SUM(X6:AB6)","v":0},{"$nulls":3},{"$f":"IF(F6>H6,1,0)","v":0},{"$f":"IF(I6>K6,1,0)","v":0},{"$f":"IF(L6>N6,1,0)","v":0},{"$f":"IF(O6>Q6,1,0)","v":0}]
[null,{"$f":"F5","v":0},{"$f":"IF(ISBLANK(H6),0,H6)","v":0},{"$f":"IF(ISBLANK(C7),\" \",\":\")","v":":"},{"$f":"IF(ISBLANK(F6),0,F6)","v":0},{"$f":"C6","v":0},{"$nulls":3},{"$f":"IF(ISBLANK(I7),\" \",\":\")","v":" "},null,null,{"$f":"IF(ISBLANK(L7),\" \",\":\")","v":" "},null,null,{"$f":"IF(ISBLANK(O7),\" \",\":\")","v":" "},null,{"$f":"C7+I7+L7+O7","v":0},{"$f":"IF(ISBLANK(R7),\" \",\":\")","v":":"},{"$f":"E7+K7+N7+Q7","v":0},{"$f":"SUM(X7:AB7)","v":0},null,null,{"$f":"IF(C7>E7,1,0)","v":0},null,{"$f":"IF(I7>K7,1,0)","v":0},{"$f":"IF(L7>N7,1,0)","v":0},{"$f":"IF(O7>Q7,1,0)","v":0}]
[null,{"$f":"I5","v":0},{"$f":"IF(ISBLANK(K6),0,K6)","v":0},{"$f":"IF(ISBLANK(C8),\" \",\":\")","v":":"},{"$f":"IF(ISBLANK(I6),0,I6)","v":0},{"$f":"IF(ISBLANK(K7),0,K7)","v":0},{"$f":"IF(ISBLANK(F8),\" \",\":\")","v":":"},{"$f":"IF(ISBLANK(I7),0,I7)","v":0},{"$f":"F7","v":0},{"$nulls":3},{"$f":"IF(ISBLANK(L8),\" \",\":\")","v":" "},null,null,{"$f":"IF(ISBLANK(O8),\" \",\":\")","v":" "},null,{"$f":"C8+F8+L8+O8","v":0},{"$f":"IF(ISBLANK(R8),\" \",\":\")","v":":"},{"$f":"E8+H8+N8+Q8","v":0},{"$f":"SUM(X8:AB8)","v":0},null,null,{"$f":"IF(C8>E8,1,0)","v":0},{"$f":"IF(F8>H8,1,0)","v":0},null,{"$f":"IF(L8>N8,1,0)","v":0},{"$f":"IF(O8>Q8,1,0)","v":0}]
[null,{"$f":"L5","v":0},{"$f":"IF(ISBLANK(N6),0,N6)","v":0},{"$f":"IF(ISBLANK(C9),\" \",\":\")","v":":"},{"$f":"IF(ISBLANK(L6),0,L6)","v":0},{"$f":"IF(ISBLANK(N7),0,N7)","v":0},{"$f":"IF(ISBLANK(F9),\" \",\":\")","v":":"},{"$f":"IF(ISBLANK(L7),0,L7)","v":0},{"$f":"IF(ISBLANK(N8),0,N8)","v":0},{"$f":"IF(ISBLANK(I9),\" \",\":\")","v":":"},{"$f":"IF(ISBLANK(L8),0,L8)","v":0},{"$f":"I8","v":0},{"$nulls":3},{"$f":"IF(ISBLANK(O9),\" \",\":\")","v":" "},null,{"$f":"C9+F9+I9+O9","v":0},{"$f":"IF(ISBLANK(R9),\" \",\":\")","v":":"},{"$f":"E9+H9+K9+Q9","v":0},{"$f":"SUM(X9:AB9)","v":0},null,null,{"$f":"IF(C9>E9,1,0)","v":0},{"$f":"IF(F9>H9,1,0)","v":0},{"$f":"IF(I9>K9,1,0)","v":0},null,{"$f":"IF(O9>Q9,1,0)","v":0}]
[]
[]
[{"$nulls":7},"SKUPINA B"]
[]
[{"$nulls":17},"Skóre",null,null,"Body","Poradie"]
[null,{"$f":"C14","v":0},{"$f":"L9","v":0},{"$nulls":3},{"$f":"IF(ISBLANK(F15),\" \",\":\")","v":" "},null,null,{"$f":"IF(ISBLANK(I15),\" \",\":\")","v":" "},null,null,{"$f":"IF(ISBLANK(L15),\" \",\":\")","v":" "},null,null,{"$f":"IF(ISBLANK(O15),\" \",\":\")","v":" "},null,{"$f":"F15+I15+L15+O15","v":0},{"$f":"IF(ISBLANK(R15),\" \",\":\")","v":":"},{"$f":"H15+K15+N15+Q15","v":0},{"$f":"SUM(X15:AB15)","v":0},{"$nulls":3},{"$f":"IF(F15>H15,1,0)","v":0},{"$f":"IF(I15>K15,1,0)","v":0},{"$f":"IF(L15>N15,1,0)","v":0},{"$f":"IF(O15>Q15,1,0)","v":0}]
[null,{"$f":"F14","v":0},{"$f":"IF(ISBLANK(H15),0,H15)","v":0},{"$f":"IF(ISBLANK(C16),\" \",\":\")","v":":"},{"$f":"IF(ISBLANK(F15),0,F15)","v":0},{"$f":"C15","v":0},{"$nulls":3},{"$f":"IF(ISBLANK(I16),\" \",\":\")","v":" "},null,null,{"$f":"IF(ISBLANK(L16),\" \",\":\")","v":" "},null,null,{"$f":"IF(ISBLANK(O16),\" \",\":\")","v":" "},null,{"$f":"C16+I16+L16+O16","v":0},{"$f":"IF(ISBLANK(R16),\" \",\":\")","v":":"},{"$f":"E16+K16+N16+Q16","v":0},{"$f":"SUM(X16:AB16)","v":0},null,null,{"$f":"IF(C16>E16,1,0)","v":0},null,{"$f":"IF(I16>K16,1,0)","v":0},{"$f":"IF(L16>N16,1,0)","v":0},{"$f":"IF(O16>Q16,1,0)","v":0}]
[null,{"$f":"I14","v":0},{"$f":"IF(ISBLANK(K15),0,K15)","v":0},{"$f":"IF(ISBLANK(C17),\" \",\":\")","v":":"},{"$f":"IF(ISBLANK(I15),0,I15)","v":0},{"$f":"IF(ISBLANK(K16),0,K16)","v":0},{"$f":"IF(ISBLANK(F17),\" \",\":\")","v":":"},{"$f":"IF(ISBLANK(I16),0,I16)","v":0},{"$f":"F16","v":0},{"$nulls":3},{"$f":"IF(ISBLANK(L17),\" \",\":\")","v":" "},null,null,{"$f":"IF(ISBLANK(O17),\" \",\":\")","v":" "},null,{"$f":"C17+F17+L17+O17","v":0},{"$f":"IF(ISBLANK(R17),\" \",\":\")","v":":"},{"$f":"E17+H17+N17+Q17","v":0},{"$f":"SUM(X17:AB17)","v":0},null,null,{"$f":"IF(C17>E17,1,0)","v":0},{"$f":"IF(F17>H17,1,0)","v":0},null,{"$f":"IF(L17>N17,1,0)","v":0},{"$f":"IF(O17>Q17,1,0)","v":0}]
[]
[]
[null,"Poradie zápasov"]
[]
[null,{"$f":"C5","v":0},{"$nulls":3},"-",null,null,{"$f":"F5","v":0}]
[null,{"$f":"I5","v":0},{"$nulls":3},"-",null,null,{"$f":"L5","v":0}]
[null,{"$f":"C14","v":0},{"$nulls":3},"-",null,null,{"$f":"F14","v":0}]
[null,{"$f":"C5","v":0},{"$nulls":3},"-",null,null,{"$f":"L5","v":0}]
[null,{"$f":"I5","v":0},{"$nulls":3},"-",null,null,{"$f":"F5","v":0}]
[null,{"$f":"I14","v":0},{"$nulls":3},"-",null,null,{"$f":"F14","v":0}]
[null,{"$f":"C5","v":0},{"$nulls":3},"-",null,null,{"$f":"I5","v":0}]
[null,{"$f":"F5","v":0},{"$nulls":3},"-",null,null,{"$f":"L5","v":0}]
[null,{"$f":"C14","v":0},{"$nulls":3},"-",null,null,{"$f":"I14","v":0}]
[]
[null,null,"Group A-3",null,null,"Group A-4",null,null,"Group B-3",{"$nulls":8},"Skóre",null,null,"Body","Poradie"]
[null,{"$f":"C32","v":"Group A-3"},{"$f":"I17","v":0},{"$nulls":3},{"$f":"IF(ISBLANK(F33),\" \",\":\")","v":" "},null,null,{"$f":"IF(ISBLANK(I33),\" \",\":\")","v":" "},null,null,{"$f":"IF(ISBLANK(L33),\" \",\":\")","v":" "},null,null,{"$f":"IF(ISBLANK(O33),\" \",\":\")","v":" "},null,{"$f":"F33+I33+L33+O33","v":0},{"$f":"IF(ISBLANK(R33),\" \",\":\")","v":":"},{"$f":"H33+K33+N33+Q33","v":0},{"$f":"SUM(X33:AB33)","v":0},{"$nulls":3},{"$f":"IF(F33>H33,1,0)","v":0},{"$f":"IF(I33>K33,1,0)","v":0},{"$f":"IF(L33>N33,1,0)","v":0},{"$f":"IF(O33>Q33,1,0)","v":0}]
[null,{"$f":"F32","v":"Group A-4"},{"$f":"IF(ISBLANK(H33),0,H33)","v":0},{"$f":"IF(ISBLANK(C34),\" \",\":\")","v":":"},{"$f":"IF(ISBLANK(F33),0,F33)","v":0},{"$f":"C33","v":0},{"$nulls":3},{"$f":"IF(ISBLANK(I34),\" \",\":\")","v":" "},null,null,{"$f":"IF(ISBLANK(L34),\" \",\":\")","v":" "},null,null,{"$f":"IF(ISBLANK(O34),\" \",\":\")","v":" "},null,{"$f":"C34+I34+L34+O34","v":0},{"$f":"IF(ISBLANK(R34),\" \",\":\")","v":":"},{"$f":"E34+K34+N34+Q34","v":0},{"$f":"SUM(X34:AB34)","v":0},null,null,{"$f":"IF(C34>E34,1,0)","v":0},null,{"$f":"IF(I34>K34,1,0)","v":0},{"$f":"IF(L34>N34,1,0)","v":0},{"$f":"IF(O34>Q34,1,0)","v":0}]
[null,{"$f":"I32","v":"Group B-3"},{"$f":"IF(ISBLANK(K33),0,K33)","v":0},{"$f":"IF(ISBLANK(C35),\" \",\":\")","v":":"},{"$f":"IF(ISBLANK(I33),0,I33)","v":0},{"$f":"IF(ISBLANK(K34),0,K34)","v":0},{"$f":"IF(ISBLANK(F35),\" \",\":\")","v":":"},{"$f":"IF(ISBLANK(I34),0,I34)","v":0},{"$f":"F34","v":0},{"$nulls":3},{"$f":"IF(ISBLANK(L35),\" \",\":\")","v":" "},null,null,{"$f":"IF(ISBLANK(O35),\" \",\":\")","v":" "},null,{"$f":"C35+F35+L35+O35","v":0},{"$f":"IF(ISBLANK(R35),\" \",\":\")","v":":"},{"$f":"E35+H35+N35+Q35","v":0},{"$f":"SUM(X35:AB35)","v":0},null,null,{"$f":"IF(C35>E35,1,0)","v":0},{"$f":"IF(F35>H35,1,0)","v":0},null,{"$f":"IF(L35>N35,1,0)","v":0},{"$f":"IF(O35>Q35,1,0)","v":0}]
[]
[null,"Poradie zápasov"]
[]
[null,{"$f":"C32","v":"Group A-3"},{"$nulls":3},"-",null,null,{"$f":"I32","v":"Group B-3"}]
[null,{"$f":"F32","v":"Group A-4"},{"$nulls":3},"-",null,null,{"$f":"I32","v":"Group B-3"}]
[]
[null,"SEMIFINÁLE"]
[null,"GROUP A-1",{"$nulls":3},"-",null,null,"GROUP B-2"]
[null,"GROUP A-2",{"$nulls":3},"-",null,null,"GROUP B-1"]
[]
[null,"Finále"]
[null,"Winner sem1",{"$nulls":3},"-",null,null,"Winner sem2"]
[]
[null,"O 3.miesto"]
[null,"Loser sem1",{"$nulls":3},"-",null,null,"Loser sem2"]

{"sheet":"Pavúk_8","index":4,"n_rows":29,"n_cols":11,"rows_kept":29,"hidden":true,"merged":[[0,2,0,3],[1,1,1,10],[2,10,4,10],[24,3,24,4]]}
[]
[null,{"$f":"C1","v":0}]
[{"$nulls":10},"poradie"]
[]
[null,"1.kolo",null,null,"2.kolo",null,"3.kolo",null,"4.kolo"]
[1,{"$f":"IF(ISBLANK($E$26),\"BYE\",$E$26)","v":"BYE"},null,"w.o",{"$f":"IF($D$6=$D$7,\" \",IF($D$6>$D$7,$B$6,$B$7))","v":"BYE"},null,{"$f":"IF($F$6=$F$7,\" \",IF($F$6>$F$7,$E$6,$E$7))","v":" "},null,{"$f":"IF($H$6=$H$7,\" \",IF($H$6>$H$7,$G$6,$G$7))","v":" "},null,{"$f":"IF(J6=J7,\" \",IF(J6>J7,1,2))","v":" "}]
[32,{"$f":"IF(ISBLANK($B$41),\"BYE\",$B$41)","v":"BYE"},null,null,{"$f":"IF($D$8=$D$9,\" \",IF($D$8>$D$9,$B$8,$B$9))","v":"BYE"},null,{"$f":"IF($F$8=$F$9,\" \",IF($F$8>$F$9,$E$8,$E$9))","v":" "},null,{"$f":"IF($H$8=$H$9,\" \",IF($H$8>$H$9,$G$8,$G$9))","v":" "},null,{"$f":"IF(J7=J6,\" \",IF(J7>J6,1,2))","v":" "}]
[17,{"$f":"IF(ISBLANK($B$34),\"BYE\",$B$34)","v":"BYE"},null,null,{"$f":"IF($D$10=$D$11,\" \",IF($D$10>$D$11,$B$10,$B$11))","v":"BYE"},null,{"$f":"IF($F$10=$F$11,\" \",IF($F$10>$F$11,$E$10,$E$11))","v":" "},null,{"$f":"IF($H$6=$H$7,\" \",IF($H$6<$H$7,$G$6,$G$7))","v":" "},null,{"$f":"IF(J8=J9,\" \",IF(J8>J9,3,4))","v":" "}]
[16,{"$f":"IF(ISBLANK($E$33),\"BYE\",$E$33)","v":"BYE"},null,"w.o",{"$f":"IF($D$12=$D$13,\" \",IF($D$12>$D$13,$B$12,$B$13))","v":"BYE"},null,{"$f":"IF($F$12=$F$13,\" \",IF($F$12>$F$13,$E$12,$E$13))","v":" "},null,{"$f":"IF($H$8=$H$9,\" \",IF($H$8<$H$9,$G$8,$G$9))","v":" "},null,{"$f":"IF(J9=J8,\" \",IF(J9>J8,3,4))","v":" "}]
[9,{"$f":"IF(ISBLANK($E$30),\"BYE\",$E$30)","v":"BYE"},null,"w.o",{"$f":"IF($D$14=$D$15,\" \",IF($D$14>$D$15,$B$14,$B$15))","v":"BYE"},null,{"$f":"IF($F$6=$F$7,\" \",IF($F$6<$F$7,$E$6,$E$7))","v":" "},null,{"$f":"IF($H$10=$H$11,\" \",IF($H$10>$H$11,$G$10,$G11))","v":" "},null,{"$f":"IF(J10=J11,\" \",IF(J10>J11,5,6))","v":" "}]
[24,{"$f":"IF(ISBLANK($B$37),\"BYE\",$B$37)","v":"BYE"},null,null,{"$f":"IF($D$16=$D$17,\" \",IF($D$16>$D$17,$B$16,$B$17))","v":"BYE"},null,{"$f":"IF($F$8=$F$9,\" \",IF($F$8<$F$9,$E$8,$E$9))","v":" "},null,{"$f":"IF($H$12=$H$13,\" \",IF($H$12>$H$13,$G$12,$G$13))","v":" "},null,{"$f":"IF(J11=J10,\" \",IF(J11>J10,5,6))","v":" "}]
[25,{"$f":"IF(ISBLANK($B$38),\"BYE\",$B$38)","v":"BYE"},null,null,{"$f":"IF($D$18=$D$19,\" \",IF($D$18>$D$19,$B$18,$B$19))","v":"BYE"},null,{"$f":"IF($F$10=$F$11,\" \",IF($F$10<$F$11,$E$10,$E$11))","v":" "},null,{"$f":"IF($H$10=$H$11,\" \",IF($H$10<$H$11,$G$10,$G11))","v":" "},null,{"$f":"IF(J12=J13,\" \",IF(J12>J13,7,8))","v":" "}]
[8,{"$f":"IF(ISBLANK($E$29),\"BYE\",$E$29)","v":"BYE"},null,"w.o",{"$f":"IF($D$20=$D$21,\" \",IF($D$20>$D$21,$B$20,$B$21))","v":"BYE"},null,{"$f":"IF($F$12=$F$13,\" \",IF($F$12<$F$13,$E$12,$E$13))","v":" "},null,{"$f":"IF($H$12=$H$13,\" \",IF($H$12<$H$13,$G$12,$G$13))","v":" "},null,{"$f":"IF(J13=J12,\" \",IF(J13>J12,7,8))","v":" "}]
[5,{"$f":"IF(ISBLANK($E$28),\"BYE\",$E$28)","v":"BYE"},null,"w.o",{"$f":"IF($D$6=$D$7,\" \",IF($D$6<$D$7,$B$6,$B$7))","v":"BYE"},null,{"$f":"IF($F$14=$F$15,\" \",IF($F$14>$F$15,$E$14,$E$15))","v":" "},null,{"$f":"IF($H$14=$H$15,\" \",IF($H$14>$H$15,$G$14,$G$15))","v":" "},null,{"$f":"IF(J14=J15,\" \",IF(J14>J15,9,10))","v":" "}]
[28,{"$f":"IF(ISBLANK($B$39),\"BYE\",$B$39)","v":"BYE"},null,null,{"$f":"IF($D$8=$D$9,\" \",IF($D$8<$D$9,$B$8,$B$9))","v":"BYE"},null,{"$f":"IF($F$16=$F$17,\" \",IF($F$16>$F$17,$E$16,$E$17))","v":" "},null,{"$f":"IF($H$16=$H$17,\" \",IF($H$16>$H$17,$G$16,$G$17))","v":" "},null,{"$f":"IF(J15=J14,\" \",IF(J15>J14,9,10))","v":" "}]
[21,{"$f":"IF(ISBLANK($E$31),\"BYE\",$E$31)","v":"BYE"},null,"w.o",{"$f":"IF($D$10=$D$11,\" \",IF($D$10<$D$11,$B$10,$B$11))","v":"BYE"},null,{"$f":"IF($F$18=$F$19,\" \",IF($F$18>$F$19,$E$18,$E$19))","v":" "},null,{"$f":"IF($H$14=$H$15,\" \",IF($H$14<$H$15,$G$14,$G$15))","v":" "},null,{"$f":"IF(J16=J17,\" \",IF(J16>J17,11,12))","v":" "}]
[12,{"$f":"IF(ISBLANK($B$36),\"BYE\",$B$36)","v":"BYE"},null,null,{"$f":"IF($D$12=$D$13,\" \",IF($D$12<$D$13,$B$12,$B$13))","v":"BYE"},null,{"$f":"IF($F$20=$F$21,\" \",IF($F$20>$F$21,$E$20,$E$21))","v":" "},null,{"$f":"IF($H$16=$H$17,\" \",IF($H$16<$H$17,$G$16,$G$17))","v":" "},null,{"$f":"IF(J17=J16,\" \",IF(J17>J16,11,12))","v":" "}]
[13,{"$f":"IF(ISBLANK($B$35),\"BYE\",$B$35)","v":"BYE"},null,null,{"$f":"IF($D$14=$D$15,\" \",IF($D$14<$D$15,$B$14,$B$15))","v":"BYE"},null,{"$f":"IF($F$14=$F$15,\" \",IF($F$14<$F$15,$E$14,$E$15))","v":" "},null,{"$f":"IF($H$18=$H$19,\" \",IF($H$18>$H$19,$G$18,$G$19))","v":" "},null,{"$f":"IF(J18=J19,\" \",IF(J18>J19,13,14))","v":" "}]
[20,{"$f":"IF(ISBLANK($E$32),\"BYE\",$E$32)","v":"BYE"},null,"w.o",{"$f":"IF($D$16=$D$17,\" \",IF($D$16<$D$17,$B$16,$B$17))","v":"BYE"},null,{"$f":"IF($F$16=$F$17,\" \",IF($F$16<$F$17,$E$16,$E$17))","v":" "},null,{"$f":"IF($H$20=$H$21,\" \",IF($H$20>$H$21,$G$20,$G$21))","v":" "},null,{"$f":"IF(J19=J18,\" \",IF(J19>J18,13,14))","v":" "}]
[29,{"$f":"IF(ISBLANK($B$40),\"BYE\",$B$40)","v":"BYE"},null,null,{"$f":"IF($D$18=$D$19,\" \",IF($D$18<$D$19,$B$18,$B$19))","v":"BYE"},null,{"$f":"IF($F$18=$F$19,\" \",IF($F$18<$F$19,$E$18,$E$19))","v":" "},null,{"$f":"IF($H$18=$H$19,\" \",IF($H$18<$H$19,$G$18,$G$19))","v":" "},null,{"$f":"IF(J20=J21,\" \",IF(J20>J21,15,16))","v":" "}]
[4,{"$f":"IF(ISBLANK($E$27),\"BYE\",$E$27)","v":"BYE"},null,"w.o",{"$f":"IF($D$20=$D$21,\" \",IF($D$20<$D$21,$B$20,$B$21))","v":"BYE"},null,{"$f":"IF($F$20=$F$21,\" \",IF($F$20<$F$21,$E$20,$E$21))","v":" "},null,{"$f":"IF($H$20=$H$21,\" \",IF($H$20<$H$21,$G$20,$G$21))","v":" "},null,{"$f":"IF(J20=J21,\" \",IF(J21>J20,15,16))","v":" "}]
[3]
[]
[]
[null,{"$f":"B1","v":0},null,{"$f":"C1","v":0}]
[{"$nulls":3},1]
[{"$nulls":3},2]
[{"$nulls":3},"3-4"]
[{"$nulls":3},"3-4"]

{"sheet":"Pavúk9","index":5,"n_rows":34,"n_cols":10,"rows_kept":34,"hidden":true,"merged":[[1,1,1,9],[2,9,4,9]]}
[]
[null,{"$f":"B1","v":0}]
[{"$nulls":9},"poradie"]
[]
[null,"1.kolo",null,"2.kolo",null,"3.kolo",null,"4.kolo"]
[1,{"$f":"IF(ISBLANK($B$26),\"BYE\",$B$26)","v":"BYE"},null,{"$f":"IF($C$6=$C$7,\" \",IF($C$6>$C$7,$B$6,$B$7))","v":" "},null,{"$f":"IF($E$6=$E$7,\" \",IF($E$6>$E$7,$D$6,$D$7))","v":" "},null,{"$f":"IF($G$6=$G$7,\" \",IF($G$6>$G$7,$F$6,$F$7))","v":" "},null,{"$f":"IF(I6=I7,\" \",IF(I6>I7,1,2))","v":" "}]
[null,{"$f":"IF(ISBLANK($B$41),\"BYE\",$B$41)","v":"BYE"},null,{"$f":"IF($C$8=$C$9,\" \",IF($C$8>$C$9,$B$8,$B$9))","v":" "},null,{"$f":"IF($E$8=$E$9,\" \",IF($E$8>$E$9,$D$8,$D$9))","v":" "},null,{"$f":"IF($G$8=$G$9,\" \",IF($G$8>$G$9,$F$8,$F$9))","v":" "},null,{"$f":"IF(I6=I7,\" \",IF(I6<I7,1,2))","v":" "}]
[null,{"$f":"IF(ISBLANK($B$34),\"BYE\",$B$34)","v":"BYE"},null,{"$f":"IF($C$10=$C$11,\" \",IF($C$10>$C$11,$B$10,$B$11))","v":" "},null,{"$f":"IF($E$10=$E$11,\" \",IF($E$10>$E$11,$D$10,$D$11))","v":" "},null,{"$f":"IF($G$6=$G$7,\" \",IF($G$6<$G$7,$F$6,$F$7))","v":" "},null,{"$f":"IF(I8=I9,\" \",IF(I8>I9,3,4))","v":" "}]
[null,{"$f":"IF(ISBLANK($B$33),\"BYE\",$B$33)","v":"BYE"},null,{"$f":"IF($C$12=$C$13,\" \",IF($C$12>$C$13,$B$12,$B$13))","v":" "},null,{"$f":"IF($E$12=$E$13,\" \",IF($E$12>$E$13,$D$12,$D$13))","v":" "},null,{"$f":"IF($G$8=$G$9,\" \",IF($G$8<$G$9,$F$8,$F$9))","v":" "},null,{"$f":"IF(I9=I8,\" \",IF(I9>I8,3,4))","v":" "}]
[null,{"$f":"IF(ISBLANK($B$30),\"BYE\",$B$30)","v":"BYE"},null,{"$f":"IF($C$14=$C$15,\" \",IF($C$14>$C$15,$B$14,$B$15))","v":" "},null,{"$f":"IF($E$6=$E$7,\" \",IF($E$6<$E$7,$D$6,$D$7))","v":" "},null,{"$f":"IF($G$10=$G$11,\" \",IF($G$10>$G$11,$F$10,$F11))","v":" "},null,{"$f":"IF(I10=I11,\" \",IF(I10>I11,5,6))","v":" "}]
[null,{"$f":"IF(ISBLANK($B$37),\"BYE\",$B$37)","v":"BYE"},null,{"$f":"IF($C$16=$C$17,\" \",IF($C$16>$C$17,$B$16,$B$17))","v":" "},null,{"$f":"IF($E$14=$E$15,\" \",IF($E$14<$E$15,$D$15,$D$14))","v":" "},null,{"$f":"IF($G$12=$G$13,\" \",IF($G$12>$G$13,$F$12,$F$13))","v":" "},null,{"$f":"IF(I11=I10,\" \",IF(I11>I10,5,6))","v":" "}]
[null,{"$f":"IF(ISBLANK($B$38),\"BYE\",$B$38)","v":"BYE"},null,{"$f":"IF($C$18=$C$19,\" \",IF($C$18>$C$19,$B$18,$B$19))","v":" "},null,{"$f":"IF($E$10=$E$11,\" \",IF($E$11<$E$10,$D$11,$D$10))","v":" "},null,{"$f":"IF($G$14=$G$15,\" \",IF($G$15<$G$14,$F$14,$F15))","v":" "},null,{"$f":"IF(I12=I13,\" \",IF(I12>I13,7,8))","v":" "}]
[null,{"$f":"IF(ISBLANK($B$29),\"BYE\",$B$29)","v":"BYE"},null,{"$f":"IF($C$20=$C$21,\" \",IF($C$20>$C$21,$B$20,$B$21))","v":" "},null,{"$f":"IF($E$12=$E$13,\" \",IF($E$12<$E$13,$D$12,$D$13))","v":" "},null,{"$f":"IF($G$10=$G$11,\" \",IF($G$10<$G$11,$F$10,$F$11))","v":" "},null,{"$f":"IF(I13=I12,\" \",IF(I13>I12,7,8))","v":" "}]
[null,{"$f":"IF(ISBLANK($B$28),\"BYE\",$B$28)","v":"BYE"},null,{"$f":"IF($E$8=$E$9,\" \",IF($E$18<$E$9,$D$8,$D$9))","v":" "},null,{"$f":"IF($E$14=$E$15,\" \",IF($E$14<$E$15,$D$14,$D$15))","v":" "},null,{"$f":"IF($G$14=$G$15,\" \",IF($G$14<$G$15,$F$14,$F$15))","v":" "},"w.o",{"$f":"IF(I14=I15,\" \",IF(I14>I15,9,10))","v":9}]
[null,{"$f":"IF(ISBLANK($B$39),\"BYE\",$B$39)","v":"BYE"},null,{"$f":"IF($C$8=$C$9,\" \",IF($C$8<$C$9,$B$8,$B$9))","v":" "},null,{"$f":"IF($G$12=$G$13,\" \",IF($G$12<$G$13,$F$12,$F$13))","v":" "},null,{"$f":"IF($G$16=$G$17,\" \",IF($G$16>$G$17,$F$16,$F$17))","v":" "},null,{"$f":"IF(I15=I16,\" \",IF(I15>I16,9,10))","v":" "}]
[null,{"$f":"IF(ISBLANK($B$31),\"BYE\",$B$31)","v":"BYE"},{"$nulls":3},{"$f":"IF($E$18=$E$19,\" \",IF($E$18>$E$19,$D$18,$D$19))","v":" "},{"$nulls":3},{"$f":"IF(I16=I17,\" \",IF(I16>I17,11,12))","v":" "}]
[null,{"$f":"IF(ISBLANK($B$36),\"BYE\",$B$36)","v":"BYE"}]
[null,{"$f":"IF(ISBLANK($B$35),\"BYE\",$B$35)","v":"BYE"}]
[null,{"$f":"IF(ISBLANK($B$32),\"BYE\",$B$32)","v":"BYE"}]
[null,{"$f":"IF(ISBLANK($B$40),\"BYE\",$B$40)","v":"BYE"}]
[2,{"$f":"IF(ISBLANK($B$27),\"BYE\",$B$27)","v":"BYE"}]
[]
[]
[]
[null,{"$f":"B1","v":0}]
[1]
[2]
[3]
[4]
[5]
[6]
[7]
[8]
[9]

{"sheet":"Pavúk_10","index":6,"n_rows":27,"n_cols":10,"rows_kept":27,"hidden":true,"merged":[[1,1,1,9],[2,9,4,9]]}
[]
[null,{"$f":"B1","v":0}]
[{"$nulls":9},"poradie"]
[]
[null,"1.kolo",null,"2.kolo",null,"3.kolo",null,"4.kolo"]
[1,{"$f":"IF(ISBLANK($B$26),\"BYE\",$B$26)","v":"BYE"},null,{"$f":"IF($C$6=$C$7,\" \",IF($C$6>$C$7,$B$6,$B$7))","v":" "},null,{"$f":"IF($E$6=$E$7,\" \",IF($E$6>$E$7,$D$6,$D$7))","v":" "},null,{"$f":"IF($G$6=$G$7,\" \",IF($G$6>$G$7,$F$6,$F$7))","v":" "},null,{"$f":"IF(I6=I7,\" \",IF(I6>I7,1,2))","v":" "}]
[null,{"$f":"IF(ISBLANK($B$41),\"BYE\",$B$41)","v":"BYE"},null,{"$f":"IF($C$8=$C$9,\" \",IF($C$8>$C$9,$B$8,$B$9))","v":" "},null,{"$f":"IF($E$8=$E$9,\" \",IF($E$8>$E$9,$D$8,$D$9))","v":" "},null,{"$f":"IF($G$8=$G$9,\" \",IF($G$8>$G$9,$F$8,$F$9))","v":" "},null,{"$f":"IF(I6=I7,\" \",IF(I6<I7,1,2))","v":" "}]
[null,{"$f":"IF(ISBLANK($B$34),\"BYE\",$B$34)","v":"BYE"},null,{"$f":"IF($C$10=$C$11,\" \",IF($C$10>$C$11,$B$10,$B$11))","v":" "},null,{"$f":"IF($E$10=$E$11,\" \",IF($E$10>$E$11,$D$10,$D$11))","v":" "},null,{"$f":"IF($G$6=$G$7,\" \",IF($G$6<$G$7,$F$6,$F$7))","v":" "},null,{"$f":"IF(I8=I9,\" \",IF(I8>I9,3,4))","v":" "}]
[null,{"$f":"IF(ISBLANK($B$33),\"BYE\",$B$33)","v":"BYE"},null,{"$f":"IF($C$12=$C$13,\" \",IF($C$12>$C$13,$B$12,$B$13))","v":" "},null,{"$f":"IF($E$12=$E$13,\" \",IF($E$12>$E$13,$D$12,$D$13))","v":" "},null,{"$f":"IF($G$8=$G$9,\" \",IF($G$8<$G$9,$F$8,$F$9))","v":" "},null,{"$f":"IF(I9=I8,\" \",IF(I9>I8,3,4))","v":" "}]
[null,{"$f":"IF(ISBLANK($B$30),\"BYE\",$B$30)","v":"BYE"},null,{"$f":"IF($C$14=$C$15,\" \",IF($C$14>$C$15,$B$14,$B$15))","v":" "},null,{"$f":"IF($E$6=$E$7,\" \",IF($E$6<$E$7,$D$6,$D$7))","v":" "},null,{"$f":"IF($G$10=$G$11,\" \",IF($G$10>$G$11,$F$10,$F11))","v":" "},null,{"$f":"IF(I10=I11,\" \",IF(I10>I11,5,6))","v":" "}]
[null,{"$f":"IF(ISBLANK($B$37),\"BYE\",$B$37)","v":"BYE"},null,{"$f":"IF($C$16=$C$17,\" \",IF($C$16>$C$17,$B$16,$B$17))","v":" "},null,{"$f":"IF($E$16=$E$17,\" \",IF($E$17<$E$16,$D$16,$D$17))","v":" "},null,{"$f":"IF($G$12=$G$13,\" \",IF($G$12>$G$13,$F$12,$F$13))","v":" "},null,{"$f":"IF(I11=I10,\" \",IF(I11>I10,5,6))","v":" "}]
[null,{"$f":"IF(ISBLANK($B$38),\"BYE\",$B$38)","v":"BYE"},null,{"$f":"IF($C$18=$C$19,\" \",IF($C$18>$C$19,$B$18,$B$19))","v":" "},null,{"$f":"IF($E$14=$E$15,\" \",IF($E$15<$E$14,$D$14,$D$15))","v":" "},null,{"$f":"IF($G$14=$G$15,\" \",IF($G$15<$G$14,$F$14,$F15))","v":" "},null,{"$f":"IF(I12=I13,\" \",IF(I12>I13,7,8))","v":" "}]
[null,{"$f":"IF(ISBLANK($B$29),\"BYE\",$B$29)","v":"BYE"},null,{"$f":"IF($C$20=$C$21,\" \",IF($C$20>$C$21,$B$20,$B$21))","v":" "},null,{"$f":"IF($E$12=$E$13,\" \",IF($E$12<$E$13,$D$12,$D$13))","v":" "},null,{"$f":"IF($G$12=$G$13,\" \",IF($G$12<$G$13,$F$12,$F$13))","v":" "},null,{"$f":"IF(I13=I12,\" \",IF(I13>I12,7,8))","v":" "}]
[null,{"$f":"IF(ISBLANK($B$28),\"BYE\",$B$28)","v":"BYE"},null,{"$f":"IF($E$8=$E$9,\" \",IF($E$18<$E$9,$D$8,$D$9))","v":" "},null,{"$f":"IF($E$14=$E$15,\" \",IF($E$14<$E$15,$D$14,$D$15))","v":" "},{"$nulls":3},{"$f":"IF(G14=G15,\" \",IF(G14>G15,9,10))","v":" "}]
[null,{"$f":"IF(ISBLANK($B$39),\"BYE\",$B$39)","v":"BYE"},null,{"$f":"IF($C$8=$C$9,\" \",IF($C$8<$C$9,$B$8,$B$9))","v":" "},null,{"$f":"IF($E$16=$E$17,\" \",IF($E$16<$E$17,$D$16,$D$17))","v":" "},{"$nulls":3},{"$f":"IF(G15=G14,\" \",IF(G15>G14,9,10))","v":" "}]
[null,{"$f":"IF(ISBLANK($B$31),\"BYE\",$B$31)","v":"BYE"},null,{"$f":"IF($C$18=$C$19,\" \",IF($C$18<$C$19,$B$18,$B$19))","v":" "},null,{"$f":"IF($E$18=$E$19,\" \",IF($E$18>$E$19,$D$18,$D$19))","v":" "},{"$nulls":3},{"$f":"IF(I16=I17,\" \",IF(I16>I17,11,12))","v":" "}]
[null,{"$f":"IF(ISBLANK($B$36),\"BYE\",$B$36)","v":"BYE"},null,{"$f":"IF($E$10=$E$11,\" \",IF($E$10<$E$11,$D$10,$D$11))","v":" "}]
[null,{"$f":"IF(ISBLANK($B$35),\"BYE\",$B$35)","v":"BYE"}]
[null,{"$f":"IF(ISBLANK($B$32),\"BYE\",$B$32)","v":"BYE"}]
[null,{"$f":"IF(ISBLANK($B$40),\"BYE\",$B$40)","v":"BYE"}]
[2,{"$f":"IF(ISBLANK($B$27),\"BYE\",$B$27)","v":"BYE"}]
[]
[]
[]
[null,{"$f":"B1","v":0}]
[1]
[2]

{"sheet":"Pavúky_11","index":7,"n_rows":29,"n_cols":40,"rows_kept":29,"hidden":true,"merged":[[1,1,1,9],[2,9,4,9],[3,17,3,22],[5,14,5,16],[5,17,5,19],[5,20,5,22],[5,23,5,25],[5,26,5,28],[5,29,5,31],[6,14,6,16],[7,17,7,19],[8,20,8,22],[12,13,12,26],[14,13,14,16],[14,18,14,29],[15,13,15,16],[15,18,15,29],[16,13,16,16],[16,18,16,29]]}
[]
[null,{"$f":"B1","v":0}]
[{"$nulls":9},"poradie",{"$nulls":23},"Späť"]
[{"$nulls":17},"O 9-11.miesto"]
[null,"1.kolo",null,"2.kolo",null,"3.kolo",null,"4.kolo"]
[1,{"$f":"IF(ISBLANK($B$26),\"BYE\",$B$26)","v":"BYE"},null,{"$f":"IF($C$6=$C$7,\" \",IF($C$6>$C$7,$B$6,$B$7))","v":" "},null,{"$f":"IF($E$6=$E$7,\" \",IF($E$6>$E$7,$D$6,$D$7))","v":" "},null,{"$f":"IF($G$6=$G$7,\" \",IF($G$6>$G$7,$F$6,$F$7))","v":" "},null,{"$f":"IF(I6=I7,\" \",IF(I6>I7,1,2))","v":" "},{"$nulls":4},{"$f":"D12","v":" "},null,null,{"$f":"D15","v":" "},null,null,{"$f":"D19","v":" "},{"$nulls":8},"Skóre",null,null,"Body","Poradie"]
[32,{"$f":"IF(ISBLANK($B$41),\"BYE\",$B$41)","v":"BYE"},null,{"$f":"IF($C$8=$C$9,\" \",IF($C$8>$C$9,$B$8,$B$9))","v":" "},null,{"$f":"IF($E$8=$E$9,\" \",IF($E$8>$E$9,$D$8,$D$9))","v":" "},null,{"$f":"IF($G$8=$G$9,\" \",IF($G$8>$G$9,$F$8,$F$9))","v":" "},null,{"$f":"IF(I7=I6,\" \",IF(I7>I6,1,2))","v":" "},{"$nulls":3},{"$f":"O6","v":" "},"B",{"$nulls":3},{"$f":"IF(ISBLANK(R7),\" \",\":\")","v":" "},null,null,{"$f":"IF(ISBLANK(U7),\" \",\":\")","v":" "},null,null,{"$f":"IF(ISBLANK(X7),\" \",\":\")","v":" "},null,null,{"$f":"IF(ISBLANK(AA7),\" \",\":\")","v":" "},null,{"$f":"R7+U7+X7+AA7","v":0},{"$f":"IF(ISBLANK(AD7),\" \",\":\")","v":":"},{"$f":"T7+W7+Z7+AC7","v":0},{"$f":"SUM(AJ7:AN7)","v":0},{"$nulls":3},{"$f":"IF(R7>T7,1,0)","v":0},{"$f":"IF(U7>W7,1,0)","v":0},{"$f":"IF(X7>Z7,1,0)","v":0},{"$f":"IF(AA7>AC7,1,0)","v":0}]
[17,{"$f":"IF(ISBLANK($B$34),\"BYE\",$B$34)","v":"BYE"},null,{"$f":"IF($C$10=$C$11,\" \",IF($C$10>$C$11,$B$10,$B$11))","v":" "},null,{"$f":"IF($E$10=$E$11,\" \",IF($E$10>$E$11,$D$10,$D$11))","v":" "},null,{"$f":"IF($G$6=$G$7,\" \",IF($G$6<$G$7,$F$6,$F$7))","v":" "},null,{"$f":"IF(I8=I9,\" \",IF(I8>I9,3,4))","v":" "},{"$nulls":3},{"$f":"R6","v":" "},{"$f":"IF(ISBLANK(T7),0,T7)","v":0},{"$f":"IF(ISBLANK(O8),\" \",\":\")","v":":"},{"$f":"IF(ISBLANK(R7),0,R7)","v":0},1,{"$nulls":3},{"$f":"IF(ISBLANK(U8),\" \",\":\")","v":" "},null,null,{"$f":"IF(ISBLANK(X8),\" \",\":\")","v":" "},null,null,{"$f":"IF(ISBLANK(AA8),\" \",\":\")","v":" "},null,{"$f":"O8+U8+X8+AA8","v":0},{"$f":"IF(ISBLANK(AD8),\" \",\":\")","v":":"},{"$f":"Q8+W8+Z8+AC8","v":0},{"$f":"SUM(AJ8:AN8)","v":0},null,null,{"$f":"IF(O8>Q8,1,0)","v":0},null,{"$f":"IF(U8>W8,1,0)","v":0},{"$f":"IF(X8>Z8,1,0)","v":0},{"$f":"IF(AA8>AC8,1,0)","v":0}]
[16,{"$f":"IF(ISBLANK($B$33),\"BYE\",$B$33)","v":"BYE"},null,{"$f":"IF($C$12=$C$13,\" \",IF($C$12>$C$13,$B$12,$B$13))","v":" "},null,{"$f":"IF($E$12=$E$13,\" \",IF($E$12>$E$13,$D$12,$D$13))","v":" "},null,{"$f":"IF($G$8=$G$9,\" \",IF($G$8<$G$9,$F$8,$F$9))","v":" "},null,{"$f":"IF(I9=I8,\" \",IF(I9>I8,3,4))","v":" "},{"$nulls":3},{"$f":"U6","v":" "},{"$f":"IF(ISBLANK(W7),0,W7)","v":0},{"$f":"IF(ISBLANK(O9),\" \",\":\")","v":":"},{"$f":"IF(ISBLANK(U7),0,U7)","v":0},{"$f":"IF(ISBLANK(W8),0,W8)","v":0},{"$f":"IF(ISBLANK(R9),\" \",\":\")","v":":"},{"$f":"IF(ISBLANK(U8),0,U8)","v":0},5,{"$nulls":3},{"$f":"IF(ISBLANK(X9),\" \",\":\")","v":" "},null,null,{"$f":"IF(ISBLANK(AA9),\" \",\":\")","v":" "},null,{"$f":"O9+R9+X9+AA9","v":0},{"$f":"IF(ISBLANK(AD9),\" \",\":\")","v":":"},{"$f":"Q9+T9+Z9+AC9","v":0},{"$f":"SUM(AJ9:AN9)","v":0},null,null,{"$f":"IF(O9>Q9,1,0)","v":0},{"$f":"IF(R9>T9,1,0)","v":0},null,{"$f":"IF(X9>Z9,1,0)","v":0},{"$f":"IF(AA9>AC9,1,0)","v":0}]
[9,{"$f":"IF(ISBLANK($B$30),\"BYE\",$B$30)","v":"BYE"},null,{"$f":"IF($C$14=$C$15,\" \",IF($C$14>$C$15,$B$14,$B$15))","v":" "},null,{"$f":"IF($E$6=$E$7,\" \",IF($E$6<$E$7,$D$6,$D$7))","v":" "},null,{"$f":"IF($G$10=$G$11,\" \",IF($G$10>$G$11,$F$10,$F11))","v":" "},null,{"$f":"IF(I10=I11,\" \",IF(I10>I11,5,6))","v":" "}]
[24,{"$f":"IF(ISBLANK($B$37),\"BYE\",$B$37)","v":"BYE"},null,{"$f":"IF($C$16=$C$17,\" \",IF($C$16>$C$17,$B$16,$B$17))","v":" "},null,{"$f":"IF($E$8=$E$9,\" \",IF($E$8<$E$9,$D$8,$D$9))","v":" "},null,{"$f":"IF($G$12=$G$13,\" \",IF($G$12>$G$13,$F$12,$F$13))","v":" "},null,{"$f":"IF(I11=I10,\" \",IF(I11>I10,5,6))","v":" "}]
[25,{"$f":"IF(ISBLANK($B$38),\"BYE\",$B$38)","v":"BYE"},null,{"$f":"IF($C$18=$C$19,\" \",IF($C$18>$C$19,$B$18,$B$19))","v":" "},null,{"$f":"IF($E$10=$E$11,\" \",IF($E$10<$E$11,$D$10,$D$11))","v":" "},null,{"$f":"IF($G$10=$G$11,\" \",IF($G$10<$G$11,$F$10,$F11))","v":" "},null,{"$f":"IF(I12=I13,\" \",IF(I12>I13,7,8))","v":" "}]
[8,{"$f":"IF(ISBLANK($B$29),\"BYE\",$B$29)","v":"BYE"},null,{"$f":"IF($C$20=$C$21,\" \",IF($C$20>$C$21,$B$20,$B$21))","v":" "},null,{"$f":"IF($E$12=$E$13,\" \",IF($E$12<$E$13,$D$12,$D$13))","v":" "},null,{"$f":"IF($G$12=$G$13,\" \",IF($G$12<$G$13,$F$12,$F$13))","v":" "},null,{"$f":"IF(I13=I12,\" \",IF(I13>I12,7,8))","v":" "},{"$nulls":3},"Poradie zápasov"]
[5,{"$f":"IF(ISBLANK($B$28),\"BYE\",$B$28)","v":"BYE"},null,{"$f":"IF($C$6=$C$7,\" \",IF($C$6<$C$7,$B$6,$B$7))","v":" "},null,{"$f":"IF($E$14=$E$15,\" \",IF($E$14>$E$15,$D$14,$D$15))","v":" "},null,{"$f":"IF($G$14=$G$15,\" \",IF($G$14>$G$15,$F$14,$F$15))","v":" "},null,{"$f":"IF(I14=I15,\" \",IF(I14>I15,9,10))","v":" "}]
[28,{"$f":"IF(ISBLANK($B$39),\"BYE\",$B$39)","v":"BYE"},null,{"$f":"IF($C$8=$C$9,\" \",IF($C$8<$C$9,$B$8,$B$9))","v":" "},null,{"$f":"IF($E$16=$E$17,\" \",IF($E$16>$E$17,$D$16,$D$17))","v":" "},null,{"$f":"IF($G$16=$G$17,\" \",IF($G$16>$G$17,$F$16,$F$17))","v":" "},null,{"$f":"IF(I15=I14,\" \",IF(I15>I14,9,10))","v":" "},{"$nulls":3},{"$f":"O6","v":" "},{"$nulls":3},"-",{"$f":"U6","v":" "}]
[21,{"$f":"IF(ISBLANK($B$31),\"BYE\",$B$31)","v":"BYE"},null,{"$f":"IF($C$10=$C$11,\" \",IF($C$10<$C$11,$B$10,$B$11))","v":" "},null,{"$f":"IF($E$18=$E$19,\" \",IF($E$18>$E$19,$D$18,$D$19))","v":" "},null,{"$f":"IF($G$14=$G$15,\" \",IF($G$14<$G$15,$F$14,$F$15))","v":" "},null,{"$f":"IF(I16=I17,\" \",IF(I16>I17,11,12))","v":" "},{"$nulls":3},{"$f":"U6","v":" "},{"$nulls":3},"-",{"$f":"R6","v":" "}]
[12,{"$f":"IF(ISBLANK($B$36),\"BYE\",$B$36)","v":"BYE"},null,{"$f":"IF($C$12=$C$13,\" \",IF($C$12<$C$13,$B$12,$B$13))","v":" "},null,{"$f":"IF($E$20=$E$21,\" \",IF($E$20>$E$21,$D$20,$D$21))","v":" "},null,{"$f":"IF($G$16=$G$17,\" \",IF($G$16<$G$17,$F$16,$F$17))","v":" "},null,{"$f":"IF(I17=I16,\" \",IF(I17>I16,11,12))","v":" "},{"$nulls":3},{"$f":"R6","v":" "},{"$nulls":3},"-",{"$f":"O6","v":" "}]
[13,{"$f":"IF(ISBLANK($B$35),\"BYE\",$B$35)","v":"BYE"},null,{"$f":"IF($C$14=$C$15,\" \",IF($C$14<$C$15,$B$14,$B$15))","v":" "},null,{"$f":"IF($E$14=$E$15,\" \",IF($E$14<$E$15,$D$14,$D$15))","v":" "},null,{"$f":"IF($G$18=$G$19,\" \",IF($G$18>$G$19,$F$18,$F$19))","v":" "},null,{"$f":"IF(I18=I19,\" \",IF(I18>I19,13,14))","v":" "}]
[20,{"$f":"IF(ISBLANK($B$32),\"BYE\",$B$32)","v":"BYE"},null,{"$f":"IF($C$16=$C$17,\" \",IF($C$16<$C$17,$B$16,$B$17))","v":" "},null,{"$f":"IF($E$16=$E$17,\" \",IF($E$16<$E$17,$D$16,$D$17))","v":" "},null,{"$f":"IF($G$20=$G$21,\" \",IF($G$20>$G$21,$F$20,$F$21))","v":" "},null,{"$f":"IF(I19=I18,\" \",IF(I19>I18,13,14))","v":" "}]
[29,{"$f":"IF(ISBLANK($B$40),\"BYE\",$B$40)","v":"BYE"},null,{"$f":"IF($C$18=$C$19,\" \",IF($C$18<$C$19,$B$18,$B$19))","v":" "},null,{"$f":"IF($E$18=$E$19,\" \",IF($E$18<$E$19,$D$18,$D$19))","v":" "},null,{"$f":"IF($G$18=$G$19,\" \",IF($G$18<$G$19,$F$18,$F$19))","v":" "},null,{"$f":"IF(I20=I21,\" \",IF(I20>I21,15,16))","v":" "}]
[4,{"$f":"IF(ISBLANK($B$27),\"BYE\",$B$27)","v":"BYE"},null,{"$f":"IF($C$20=$C$21,\" \",IF($C$20<$C$21,$B$20,$B$21))","v":" "},null,{"$f":"IF($E$20=$E$21,\" \",IF($E$20<$E$21,$D$20,$D$21))","v":" "},null,{"$f":"IF($G$20=$G$21,\" \",IF($G$20<$G$21,$F$20,$F$21))","v":" "},null,{"$f":"IF(I20=I21,\" \",IF(I21>I20,15,16))","v":" "}]
[3]
[]
[null,"o 9-11.miesto"]
[null,{"$f":"B2","v":0}]
[1]
[2]
["3-4"]
["3-4"]

{"sheet":"Pavúk_12","index":8,"n_rows":27,"n_cols":10,"rows_kept":27,"hidden":true,"merged":[[1,1,1,9]]}
[]
[null,{"$f":"B1","v":0}]
[null,"1.kolo",null,"2.kolo",null,"3.kolo",null,"4.kolo"]
[1,{"$f":"IF(ISBLANK($B$24),\"BYE\",$B$24)","v":"BYE"},null,{"$f":"IF($C$4=$C$5,\" \",IF($C$4>$C$5,$B$4,$B$5))","v":" "},"w.o",{"$f":"IF($E$4=$E$5,\" \",IF($E$4>$E$5,$D$4,$D$5))","v":" "},null,{"$f":"IF($G$4=$G$5,\" \",IF($G$4>$G$5,$F$4,$F$5))","v":" "},null,{"$f":"IF(I4=I5,\" \",IF(I4>I5,1,2))","v":" "}]
[32,{"$f":"IF(ISBLANK($B$39),\"BYE\",$B$39)","v":"BYE"},null,{"$f":"IF($C$6=$C$7,\" \",IF($C$6>$C$7,$B$6,$B$7))","v":" "},null,{"$f":"IF($E$6=$E$7,\" \",IF($E$6>$E$7,$D$6,$D$7))","v":" "},null,{"$f":"IF($G$6=$G$7,\" \",IF($G$6>$G$7,$F$6,$F$7))","v":" "},null,{"$f":"IF(I5=I4,\" \",IF(I5>I4,1,2))","v":" "}]
[17,{"$f":"IF(ISBLANK($B$32),\"BYE\",$B$32)","v":"BYE"},null,{"$f":"IF($C$8=$C$9,\" \",IF($C$8>$C$9,$B$8,$B$9))","v":" "},null,{"$f":"IF($E$8=$E$9,\" \",IF($E$8>$E$9,$D$8,$D$9))","v":" "},null,{"$f":"IF($G$4=$G$5,\" \",IF($G$4<$G$5,$F$4,$F$5))","v":" "},null,{"$f":"IF(I6=I7,\" \",IF(I6>I7,3,4))","v":" "}]
[16,{"$f":"IF(ISBLANK($B$31),\"BYE\",$B$31)","v":"BYE"},null,{"$f":"IF($C$10=$C$11,\" \",IF($C$10>$C$11,$B$10,$B$11))","v":" "},null,{"$f":"IF($E$10=$E$11,\" \",IF($E$10>$E$11,$D$10,$D$11))","v":" "},null,{"$f":"IF($G$6=$G$7,\" \",IF($G$6<$G$7,$F$6,$F$7))","v":" "},null,{"$f":"IF(I7=I6,\" \",IF(I7>I6,3,4))","v":" "}]
[9,{"$f":"IF(ISBLANK($B$28),\"BYE\",$B$28)","v":"BYE"},null,{"$f":"IF($C$12=$C$13,\" \",IF($C$12>$C$13,$B$12,$B$13))","v":" "},null,{"$f":"IF($E$4=$E$5,\" \",IF($E$4<$E$5,$D$4,$D$5))","v":" "},null,{"$f":"IF($G$8=$G$9,\" \",IF($G$8>$G$9,$F$8,$F9))","v":" "},null,{"$f":"IF(I8=I9,\" \",IF(I8>I9,5,6))","v":" "}]
[24,{"$f":"IF(ISBLANK($B$35),\"BYE\",$B$35)","v":"BYE"},null,{"$f":"IF($C$14=$C$15,\" \",IF($C$14>$C$15,$B$14,$B$15))","v":" "},null,{"$f":"IF($E$6=$E$7,\" \",IF($E$6<$E$7,$D$6,$D$7))","v":" "},null,{"$f":"IF($G$10=$G$11,\" \",IF($G$10>$G$11,$F$10,$F$11))","v":" "},null,{"$f":"IF(I9=I8,\" \",IF(I9>I8,5,6))","v":" "}]
[25,{"$f":"IF(ISBLANK($B$36),\"BYE\",$B$36)","v":"BYE"},null,{"$f":"IF($C$16=$C$17,\" \",IF($C$16>$C$17,$B$16,$B$17))","v":" "},null,{"$f":"IF($E$8=$E$9,\" \",IF($E$8<$E$9,$D$8,$D$9))","v":" "},null,{"$f":"IF($G$8=$G$9,\" \",IF($G$8<$G$9,$F$8,$F9))","v":" "},null,{"$f":"IF(I10=I11,\" \",IF(I10>I11,7,8))","v":" "}]
[8,{"$f":"IF(ISBLANK($B$27),\"BYE\",$B$27)","v":"BYE"},null,{"$f":"IF($C$18=$C$19,\" \",IF($C$18>$C$19,$B$18,$B$19))","v":" "},"w.o",{"$f":"IF($E$10=$E$11,\" \",IF($E$10<$E$11,$D$10,$D$11))","v":" "},null,{"$f":"IF($G$10=$G$11,\" \",IF($G$10<$G$11,$F$10,$F$11))","v":" "},null,{"$f":"IF(I11=I10,\" \",IF(I11>I10,7,8))","v":" "}]
[5,{"$f":"IF(ISBLANK($B$26),\"BYE\",$B$26)","v":"BYE"},null,{"$f":"IF($C$4=$C$5,\" \",IF($C$4<$C$5,$B$4,$B$5))","v":" "},null,{"$f":"IF($E$12=$E$13,\" \",IF($E$12>$E$13,$D$12,$D$13))","v":" "},null,{"$f":"IF($G$12=$G$13,\" \",IF($G$12>$G$13,$F$12,$F$13))","v":" "},null,{"$f":"IF(I12=I13,\" \",IF(I12>I13,9,10))","v":" "}]
[28,{"$f":"IF(ISBLANK($B$37),\"BYE\",$B$37)","v":"BYE"},null,{"$f":"IF($C$6=$C$7,\" \",IF($C$6<$C$7,$B$6,$B$7))","v":" "},null,{"$f":"IF($E$14=$E$15,\" \",IF($E$14>$E$15,$D$14,$D$15))","v":" "},null,{"$f":"IF($G$14=$G$15,\" \",IF($G$14>$G$15,$F$14,$F$15))","v":" "},null,{"$f":"IF(I13=I12,\" \",IF(I13>I12,9,10))","v":" "}]
[21,{"$f":"IF(ISBLANK($B$29),\"BYE\",$B$29)","v":"BYE"},null,{"$f":"IF($C$8=$C$9,\" \",IF($C$8<$C$9,$B$8,$B$9))","v":" "},null,{"$f":"IF($E$16=$E$17,\" \",IF($E$16>$E$17,$D$16,$D$17))","v":" "},null,{"$f":"IF($G$12=$G$13,\" \",IF($G$12<$G$13,$F$12,$F$13))","v":" "},null,{"$f":"IF(I14=I15,\" \",IF(I14>I15,11,12))","v":" "}]
[12,{"$f":"IF(ISBLANK($B$34),\"BYE\",$B$34)","v":"BYE"},null,{"$f":"IF($C$10=$C$11,\" \",IF($C$10<$C$11,$B$10,$B$11))","v":" "},null,{"$f":"IF($E$18=$E$19,\" \",IF($E$18>$E$19,$D$18,$D$19))","v":" "},null,{"$f":"IF($G$14=$G$15,\" \",IF($G$14<$G$15,$F$14,$F$15))","v":" "},null,{"$f":"IF(I15=I14,\" \",IF(I15>I14,11,12))","v":" "}]
[13,{"$f":"IF(ISBLANK($B$33),\"BYE\",$B$33)","v":"BYE"},null,{"$f":"IF($C$12=$C$13,\" \",IF($C$12<$C$13,$B$12,$B$13))","v":" "},null,{"$f":"IF($E$12=$E$13,\" \",IF($E$12<$E$13,$D$12,$D$13))","v":" "},null,{"$f":"IF($G$16=$G$17,\" \",IF($G$16>$G$17,$F$16,$F$17))","v":" "},null,{"$f":"IF(I16=I17,\" \",IF(I16>I17,13,14))","v":" "}]
[20,{"$f":"IF(ISBLANK($B$30),\"BYE\",$B$30)","v":"BYE"},null,{"$f":"IF($C$14=$C$15,\" \",IF($C$14<$C$15,$B$14,$B$15))","v":" "},"w.o",{"$f":"IF($E$14=$E$15,\" \",IF($E$14<$E$15,$D$14,$D$15))","v":" "},null,{"$f":"IF($G$18=$G$19,\" \",IF($G$18>$G$19,$F$18,$F$19))","v":" "},null,{"$f":"IF(I17=I16,\" \",IF(I17>I16,13,14))","v":" "}]
[29,{"$f":"IF(ISBLANK($B$38),\"BYE\",$B$38)","v":"BYE"},null,{"$f":"IF($C$16=$C$17,\" \",IF($C$16<$C$17,$B$16,$B$17))","v":" "},"w.o",{"$f":"IF($E$16=$E$17,\" \",IF($E$16<$E$17,$D$16,$D$17))","v":" "},null,{"$f":"IF($G$16=$G$17,\" \",IF($G$16<$G$17,$F$16,$F$17))","v":" "},null,{"$f":"IF(I18=I19,\" \",IF(I18>I19,15,16))","v":" "}]
[4,{"$f":"IF(ISBLANK($B$25),\"BYE\",$B$25)","v":"BYE"},null,{"$f":"IF($C$18=$C$19,\" \",IF($C$18<$C$19,$B$18,$B$19))","v":" "},null,{"$f":"IF($E$18=$E$19,\" \",IF($E$18<$E$19,$D$18,$D$19))","v":" "},null,{"$f":"IF($G$18=$G$19,\" \",IF($G$18<$G$19,$F$18,$F$19))","v":" "},null,{"$f":"IF(I18=I19,\" \",IF(I19>I18,15,16))","v":" "}]
[3]
[]
[]
[null,{"$f":"B1","v":0}]
[1]
[2]
["3-4"]
["3-4"]

{"sheet":"pavúk_16","index":9,"n_rows":41,"n_cols":10,"rows_kept":41,"hidden":true,"merged":[[1,1,1,9],[2,9,4,9]]}
[]
[null,{"$f":"B1","v":0}]
[{"$nulls":9},"poradie"]
[]
[null,"1.kolo",null,"2.kolo",null,"3.kolo",null,"4.kolo"]
[1,{"$f":"IF(ISBLANK($B$26),\"BYE\",$B$26)","v":"BYE"},null,{"$f":"IF($C$6=$C$7,\" \",IF($C$6>$C$7,$B$6,$B$7))","v":" "},null,{"$f":"IF($E$6=$E$7,\" \",IF($E$6>$E$7,$D$6,$D$7))","v":" "},null,{"$f":"IF($G$6=$G$7,\" \",IF($G$6>$G$7,$F$6,$F$7))","v":" "},null,{"$f":"IF(I6=I7,\" \",IF(I6>I7,1,2))","v":" "}]
[32,{"$f":"IF(ISBLANK($B$41),\"BYE\",$B$41)","v":"BYE"},null,{"$f":"IF($C$8=$C$9,\" \",IF($C$8>$C$9,$B$8,$B$9))","v":" "},null,{"$f":"IF($E$8=$E$9,\" \",IF($E$8>$E$9,$D$8,$D$9))","v":" "},null,{"$f":"IF($G$8=$G$9,\" \",IF($G$8>$G$9,$F$8,$F$9))","v":" "},null,{"$f":"IF(I7=I6,\" \",IF(I7>I6,1,2))","v":" "}]
[17,{"$f":"IF(ISBLANK($B$34),\"BYE\",$B$34)","v":"BYE"},null,{"$f":"IF($C$10=$C$11,\" \",IF($C$10>$C$11,$B$10,$B$11))","v":" "},null,{"$f":"IF($E$10=$E$11,\" \",IF($E$10>$E$11,$D$10,$D$11))","v":" "},null,{"$f":"IF($G$6=$G$7,\" \",IF($G$6<$G$7,$F$6,$F$7))","v":" "},null,{"$f":"IF(I8=I9,\" \",IF(I8>I9,3,4))","v":" "}]
[16,{"$f":"IF(ISBLANK($B$33),\"BYE\",$B$33)","v":"BYE"},null,{"$f":"IF($C$12=$C$13,\" \",IF($C$12>$C$13,$B$12,$B$13))","v":" "},null,{"$f":"IF($E$12=$E$13,\" \",IF($E$12>$E$13,$D$12,$D$13))","v":" "},null,{"$f":"IF($G$8=$G$9,\" \",IF($G$8<$G$9,$F$8,$F$9))","v":" "},null,{"$f":"IF(I9=I8,\" \",IF(I9>I8,3,4))","v":" "}]
[9,{"$f":"IF(ISBLANK($B$30),\"BYE\",$B$30)","v":"BYE"},null,{"$f":"IF($C$14=$C$15,\" \",IF($C$14>$C$15,$B$14,$B$15))","v":" "},null,{"$f":"IF($E$6=$E$7,\" \",IF($E$6<$E$7,$D$6,$D$7))","v":" "},null,{"$f":"IF($G$10=$G$11,\" \",IF($G$10>$G$11,$F$10,$F11))","v":" "},null,{"$f":"IF(I10=I11,\" \",IF(I10>I11,5,6))","v":" "}]
[24,{"$f":"IF(ISBLANK($B$37),\"BYE\",$B$37)","v":"BYE"},null,{"$f":"IF($C$16=$C$17,\" \",IF($C$16>$C$17,$B$16,$B$17))","v":" "},null,{"$f":"IF($E$8=$E$9,\" \",IF($E$8<$E$9,$D$8,$D$9))","v":" "},null,{"$f":"IF($G$12=$G$13,\" \",IF($G$12>$G$13,$F$12,$F$13))","v":" "},null,{"$f":"IF(I11=I10,\" \",IF(I11>I10,5,6))","v":" "}]
[25,{"$f":"IF(ISBLANK($B$38),\"BYE\",$B$38)","v":"BYE"},null,{"$f":"IF($C$18=$C$19,\" \",IF($C$18>$C$19,$B$18,$B$19))","v":" "},null,{"$f":"IF($E$10=$E$11,\" \",IF($E$10<$E$11,$D$10,$D$11))","v":" "},null,{"$f":"IF($G$10=$G$11,\" \",IF($G$10<$G$11,$F$10,$F11))","v":" "},null,{"$f":"IF(I12=I13,\" \",IF(I12>I13,7,8))","v":" "}]
[8,{"$f":"IF(ISBLANK($B$29),\"BYE\",$B$29)","v":"BYE"},null,{"$f":"IF($C$20=$C$21,\" \",IF($C$20>$C$21,$B$20,$B$21))","v":" "},null,{"$f":"IF($E$12=$E$13,\" \",IF($E$12<$E$13,$D$12,$D$13))","v":" "},null,{"$f":"IF($G$12=$G$13,\" \",IF($G$12<$G$13,$F$12,$F$13))","v":" "},null,{"$f":"IF(I13=I12,\" \",IF(I13>I12,7,8))","v":" "}]
[5,{"$f":"IF(ISBLANK($B$28),\"BYE\",$B$28)","v":"BYE"},null,{"$f":"IF($C$6=$C$7,\" \",IF($C$6<$C$7,$B$6,$B$7))","v":" "},null,{"$f":"IF($E$14=$E$15,\" \",IF($E$14>$E$15,$D$14,$D$15))","v":" "},null,{"$f":"IF($G$14=$G$15,\" \",IF($G$14>$G$15,$F$14,$F$15))","v":" "},null,{"$f":"IF(I14=I15,\" \",IF(I14>I15,9,10))","v":" "}]
[28,{"$f":"IF(ISBLANK($B$39),\"BYE\",$B$39)","v":"BYE"},null,{"$f":"IF($C$8=$C$9,\" \",IF($C$8<$C$9,$B$8,$B$9))","v":" "},null,{"$f":"IF($E$16=$E$17,\" \",IF($E$16>$E$17,$D$16,$D$17))","v":" "},null,{"$f":"IF($G$16=$G$17,\" \",IF($G$16>$G$17,$F$16,$F$17))","v":" "},null,{"$f":"IF(I15=I14,\" \",IF(I15>I14,9,10))","v":" "}]
[21,{"$f":"IF(ISBLANK($B$31),\"BYE\",$B$31)","v":"BYE"},null,{"$f":"IF($C$10=$C$11,\" \",IF($C$10<$C$11,$B$10,$B$11))","v":" "},null,{"$f":"IF($E$18=$E$19,\" \",IF($E$18>$E$19,$D$18,$D$19))","v":" "},null,{"$f":"IF($G$14=$G$15,\" \",IF($G$14<$G$15,$F$14,$F$15))","v":" "},null,{"$f":"IF(I16=I17,\" \",IF(I16>I17,11,12))","v":" "}]
[12,{"$f":"IF(ISBLANK($B$36),\"BYE\",$B$36)","v":"BYE"},null,{"$f":"IF($C$12=$C$13,\" \",IF($C$12<$C$13,$B$12,$B$13))","v":" "},null,{"$f":"IF($E$20=$E$21,\" \",IF($E$20>$E$21,$D$20,$D$21))","v":" "},null,{"$f":"IF($G$16=$G$17,\" \",IF($G$16<$G$17,$F$16,$F$17))","v":" "},null,{"$f":"IF(I17=I16,\" \",IF(I17>I16,11,12))","v":" "}]
[13,{"$f":"IF(ISBLANK($B$35),\"BYE\",$B$35)","v":"BYE"},null,{"$f":"IF($C$14=$C$15,\" \",IF($C$14<$C$15,$B$14,$B$15))","v":" "},null,{"$f":"IF($E$14=$E$15,\" \",IF($E$14<$E$15,$D$14,$D$15))","v":" "},null,{"$f":"IF($G$18=$G$19,\" \",IF($G$18>$G$19,$F$18,$F$19))","v":" "},null,{"$f":"IF(I18=I19,\" \",IF(I18>I19,13,14))","v":" "}]
[20,{"$f":"IF(ISBLANK($B$32),\"BYE\",$B$32)","v":"BYE"},null,{"$f":"IF($C$16=$C$17,\" \",IF($C$16<$C$17,$B$16,$B$17))","v":" "},null,{"$f":"IF($E$16=$E$17,\" \",IF($E$16<$E$17,$D$16,$D$17))","v":" "},null,{"$f":"IF($G$20=$G$21,\" \",IF($G$20>$G$21,$F$20,$F$21))","v":" "},null,{"$f":"IF(I19=I18,\" \",IF(I19>I18,13,14))","v":" "}]
[29,{"$f":"IF(ISBLANK($B$40),\"BYE\",$B$40)","v":"BYE"},null,{"$f":"IF($C$18=$C$19,\" \",IF($C$18<$C$19,$B$18,$B$19))","v":" "},null,{"$f":"IF($E$18=$E$19,\" \",IF($E$18<$E$19,$D$18,$D$19))","v":" "},null,{"$f":"IF($G$18=$G$19,\" \",IF($G$18<$G$19,$F$18,$F$19))","v":" "},null,{"$f":"IF(I20=I21,\" \",IF(I20>I21,15,16))","v":" "}]
[4,{"$f":"IF(ISBLANK($B$27),\"BYE\",$B$27)","v":"BYE"},null,{"$f":"IF($C$20=$C$21,\" \",IF($C$20<$C$21,$B$20,$B$21))","v":" "},null,{"$f":"IF($E$20=$E$21,\" \",IF($E$20<$E$21,$D$20,$D$21))","v":" "},null,{"$f":"IF($G$20=$G$21,\" \",IF($G$20<$G$21,$F$20,$F$21))","v":" "},null,{"$f":"IF(I20=I21,\" \",IF(I21>I20,15,16))","v":" "}]
[3]
[]
[]
[null,{"$f":"B1","v":0}]
[1]
[2]
[3]
[4]
[5]
[6]
[7]
[8]
[9]
[10]
[11]
[12]
[13]
[14]
[15]
[16]

{"sheet":"Pavúk_17","index":10,"n_rows":71,"n_cols":12,"rows_kept":71,"hidden":true,"merged":[[1,1,1,11]]}
[]
[null,{"$f":"B1","v":0}]
[null,"1.kolo",null,"2.kolo",null,"3.kolo",null,"4.kolo",null,"5.kolo"]
[1,{"$f":"IF(ISBLANK($B$40),\"BYE\",$B$40)","v":"BYE"},"w.o.",{"$f":"IF($C$4=$C$5,\" \",IF($C$4>$C$5,$B$4,$B$5))","v":"BYE"},3,{"$f":"IF($E$4=$E$5,\" \",IF($E$4>$E$5,$D$4,$D$5))","v":"BYE"},3,{"$f":"IF($G$4=$G$5,\" \",IF($G$4>$G$5,$F$4,$F$5))","v":"BYE"},3,{"$f":"IF($I$4=$I$5,\" \",IF($I$4>$I$5,$H$4,$H$5))","v":"BYE"},3,{"$f":"IF(K4=K5,\" \",IF(K4>K5,1,2))","v":1}]
[32,{"$f":"IF(ISBLANK($B$71),\"BYE\",$B$71)","v":"BYE"},null,{"$f":"IF($C$6=$C$7,\" \",IF($C$6>$C$7,$B$6,$B$7))","v":"BYE"},0,{"$f":"IF($E$6=$E$7,\" \",IF($E$6>$E$7,$D$6,$D$7))","v":"BYE"},0,{"$f":"IF($G$6=$G$7,\" \",IF($G$6>$G$7,$F$6,$F$7))","v":"BYE"},0,{"$f":"IF($I$6=$I$7,\" \",IF($I$6>$I$7,$H$6,$H$7))","v":"BYE"},1,{"$f":"IF(K4=K5,\" \",IF(K4<K5,1,2))","v":2}]
[17,{"$f":"IF(ISBLANK($B$56),\"BYE\",$B$56)","v":"BYE"},0,{"$f":"IF($C$8=$C$9,\" \",IF($C$8>$C$9,$B$8,$B$9))","v":"BYE"},0,{"$f":"IF($E$8=$E$9,\" \",IF($E$8>$E$9,$D$8,$D$9))","v":"BYE"},1,{"$f":"IF($G$8=$G$9,\" \",IF($G$8>$G$9,$F$8,$F9))","v":"BYE"},3,{"$f":"IF($I$6=$I$7,\" \",IF($I$6<$I$7,$H$6,$H$7))","v":"BYE"},3,{"$f":"IF(K6=K7,\" \",IF(K6>K7,3,4))","v":3}]
[16,{"$f":"IF(ISBLANK($B$55),\"BYE\",$B$55)","v":"BYE"},3,{"$f":"IF($C$10=$C$11,\" \",IF($C$10>$C$11,$B$10,$B$11))","v":"BYE"},3,{"$f":"IF($E$10=$E$11,\" \",IF($E$10>$E$11,$D$10,$D$11))","v":"BYE"},3,{"$f":"IF($G$10=$G$11,\" \",IF($G$10>$G$11,$F$10,$F$11))","v":"BYE"},0,{"$f":"IF($I$4=$I$5,\" \",IF($I$4<$I$5,$H$4,$H$5))","v":"BYE"},2,{"$f":"IF(K6=K7,\" \",IF(K6<K7,3,4))","v":4}]
[9,{"$f":"IF(ISBLANK($B$48),\"BYE\",$B$48)","v":"BYE"},"w.o.",{"$f":"IF($C$12=$C$13,\" \",IF($C$12>$C$13,$B$12,$B$13))","v":"BYE"},3,{"$f":"IF($E$12=$E$13,\" \",IF($E$12>$E$13,$D$12,$D$13))","v":"BYE"},1,{"$f":"IF($G$4=$G$5,\" \",IF($G$4<$G$5,$F$4,$F$5))","v":"BYE"},2,{"$f":"IF($I$8=$I$9,\" \",IF($I$8>$I$9,$H$8,$H$9))","v":"BYE"},1,{"$f":"IF(K8=K9,\" \",IF(K8>K9,5,6))","v":6}]
[24,{"$f":"IF(ISBLANK($B$63),\"BYE\",$B$63)","v":"BYE"},null,{"$f":"IF($C$14=$C$15,\" \",IF($C$14>$C$15,$B$14,$B$15))","v":"BYE"},0,{"$f":"IF($E$14=$E$15,\" \",IF($E$14>$E$15,$D$14,$D$15))","v":"BYE"},3,{"$f":"IF($G$6=$G$7,\" \",IF($G$6<$G$7,$F$6,$F$7))","v":"BYE"},3,{"$f":"IF($I$10=$I$11,\" \",IF($I$10>$I$11,$H$10,$H$11))","v":"BYE"},3,{"$f":"IF(K8=K9,\" \",IF(K8<K9,5,6))","v":5}]
[25,{"$f":"IF(ISBLANK($B$64),\"BYE\",$B$64)","v":"BYE"},null,{"$f":"IF($C$16=$C$17,\" \",IF($C$16>$C$17,$B$16,$B$17))","v":"BYE"},0,{"$f":"IF($E$16=$E$17,\" \",IF($E$16>$E$17,$D$16,$D$17))","v":"BYE"},0,{"$f":"IF($G$8=$G$9,\" \",IF($G$8<$G$9,$F$8,$F9))","v":"BYE"},3,{"$f":"IF($I$8=$I$9,\" \",IF($I$8<$I$9,$H$8,$H$9))","v":"BYE"},0,{"$f":"IF(K10=K11,\" \",IF(K10>K11,7,8))","v":8}]
[8,{"$f":"IF(ISBLANK($B$47),\"BYE\",$B$47)","v":"BYE"},"w.o.",{"$f":"IF($C$18=$C$19,\" \",IF($C$18>$C$19,$B$18,$B$19))","v":"BYE"},3,{"$f":"IF($E$18=$E$19,\" \",IF($E$18>$E$19,$D$18,$D$19))","v":"BYE"},3,{"$f":"IF($G$10=$G$11,\" \",IF($G$10<$G$11,$F$10,$F$11))","v":"BYE"},0,{"$f":"IF($I$10=$I$11,\" \",IF($I$10<$I$11,$H$10,$H$11))","v":"BYE"},3,{"$f":"IF(K10=K11,\" \",IF(K10<K11,7,8))","v":7}]
[5,{"$f":"IF(ISBLANK($B$44),\"BYE\",$B$44)","v":"BYE"},"w.o.",{"$f":"IF($C$20=$C$21,\" \",IF($C$20>$C$21,$B$20,$B$21))","v":"BYE"},3,{"$f":"IF($E$4=$E$5,\" \",IF($E$4<$E$5,$D$4,$D$5))","v":"BYE"},3,{"$f":"IF($G$12=$G$13,\" \",IF($G$12>$G$13,$F$12,$F$13))","v":"BYE"},1,{"$f":"IF($I$12=$I$13,\" \",IF($I$12>$I$13,$H$12,$H$13))","v":"BYE"},0,{"$f":"IF(K12=K13,\" \",IF(K12>K13,9,10))","v":10}]
[28,{"$f":"IF(ISBLANK($B$67),\"BYE\",$B$67)","v":"BYE"},null,{"$f":"IF($C$22=$C$23,\" \",IF($C$22>$C$23,$B$22,$B23))","v":"BYE"},0,{"$f":"IF($E$6=$E$7,\" \",IF($E$6<$E$7,$D$6,$D$7))","v":"BYE"},0,{"$f":"IF($G$14=$G$15,\" \",IF($G$14>$G$15,$F$14,$F$15))","v":"BYE"},3,{"$f":"IF($I$14=$I$15,\" \",IF($I$14>$I$15,$H$14,$H$15))","v":"BYE"},3,{"$f":"IF(K12=K13,\" \",IF(K12<K13,9,10))","v":9}]
[21,{"$f":"IF(ISBLANK($B$60),\"BYE\",$B$60)","v":"BYE"},null,{"$f":"IF($C$24=$C$25,\" \",IF($C$24>$C$25,$B$24,$B$25))","v":"BYE"},0,{"$f":"IF($E$8=$E$9,\" \",IF($E$8<$E$9,$D$8,$D$9))","v":"BYE"},0,{"$f":"IF($G$16=$G$17,\" \",IF($G$16>$G$17,$F$16,$F$17))","v":"BYE"},3,{"$f":"IF($I$12=$I$13,\" \",IF($I$12<$I$13,$H$12,$H$13))","v":"BYE"},2,{"$f":"IF(K14=K15,\" \",IF(K14>K15,11,12))","v":12}]
[12,{"$f":"IF(ISBLANK($B$51),\"BYE\",$B$51)","v":"BYE"},"w.o.",{"$f":"IF($C$26=$C$27,\" \",IF($C$26>$C$27,$B$26,$B$27))","v":"BYE"},3,{"$f":"IF($E$10=$E$11,\" \",IF($E$10<$E$11,$D$10,$D$11))","v":"BYE"},3,{"$f":"IF($G$18=$G$19,\" \",IF($G$18>$G$19,$F$18,$F$19))","v":"BYE"},0,{"$f":"IF($I$14=$I$15,\" \",IF($I$14<$I$15,$H$14,$H$15))","v":"BYE"},3,{"$f":"IF(K14=K15,\" \",IF(K14<K15,11,12))","v":11}]
[13,{"$f":"IF(ISBLANK($B$52),\"BYE\",$B$52)","v":"BYE"},"w.o.",{"$f":"IF($C$28=$C$29,\" \",IF($C$28>$C$29,$B$28,$B$29))","v":"BYE"},3,{"$f":"IF($E$12=$E$13,\" \",IF($E$12<$E$13,$D$12,$D$13))","v":"BYE"},3,{"$f":"IF($G$12=$G$13,\" \",IF($G$12<$G$13,$F$12,$F$13))","v":"BYE"},1,{"$f":"IF($I$16=$I$17,\" \",IF($I$16>$I$17,$H$16,$H$17))","v":"BYE"},0,{"$f":"IF(K16=K17,\" \",IF(K16>K17,13,14))","v":14}]
[20,{"$f":"IF(ISBLANK($B$59),\"BYE\",$B$59)","v":"BYE"},null,{"$f":"IF($C$30=$C$31,\" \",IF($C$30>$C$31,$B$30,$B$31))","v":"BYE"},1,{"$f":"IF($E$14=$E$15,\" \",IF($E$14<$E$15,$D$14,$D$15))","v":"BYE"},0,{"$f":"IF($G$20=$G$21,\" \",IF($G$20>$G$21,$F$20,$F$21))","v":"BYE"},3,{"$f":"IF($I$18=$I$19,\" \",IF($I$18>$I$19,$H$18,$H$19))","v":"BYE"},3,{"$f":"IF(K16=K17,\" \",IF(K16<K17,13,14))","v":13}]
[29,{"$f":"IF(ISBLANK($B$68),\"BYE\",$B$68)","v":"BYE"},null,{"$f":"IF($C$32=$C$33,\" \",IF($C$32>$C$33,$B$32,$B$33))","v":"BYE"},0,{"$f":"IF($E$16=$E$17,\" \",IF($E$16<$E$17,$D$16,$D$17))","v":"BYE"},3,{"$f":"IF($G$16=$G$17,\" \",IF($G$16<$G$17,$F$16,$F$17))","v":"BYE"},3,{"$f":"IF($I$16=$I$17,\" \",IF($I$16<$I$17,$H$16,$H$17))","v":"BYE"},3,{"$f":"IF(K18=K19,\" \",IF(K18>K19,15,16))","v":15}]
[4,{"$f":"IF(ISBLANK($B$43),\"BYE\",$B$43)","v":"BYE"},"w.o.",{"$f":"IF($C$34=$C$35,\" \",IF($C$34>$C$35,$B$34,$B$35))","v":"BYE"},3,{"$f":"IF($E$20=$E$21,\" \",IF($E$20>$E$21,$D$20,$D$21))","v":"BYE"},2,{"$f":"IF($G$18=$G$19,\" \",IF($G$18<$G$19,$F$18,$F$19))","v":"BYE"},0,{"$f":"IF($I$20=$I$21,\" \",IF($I$20>$I$21,$H$20,$H$21))","v":"BYE"},0,{"$f":"IF(K18=K19,\" \",IF(K18<K19,15,16))","v":16}]
[3,{"$f":"IF(ISBLANK($B$42),\"BYE\",$B$42)","v":"BYE"},"w.o.",{"$f":"IF($E$18=$E$19,\" \",IF($E$18<$E$19,$D$18,$D$19))","v":"BYE"},3,{"$f":"IF($E$20=$E$21,\" \",IF($E$20<$E$21,$D$20,$D$21))","v":"BYE"},3,{"$f":"IF($G$20=$G$21,\" \",IF($G$20<$G$21,$F$20,$F$21))","v":"BYE"},0,{"$f":"IF($I$20=$I$21,\" \",IF($I$20<$I$21,$H$20,$H$21))","v":"BYE"},"w.o",{"$f":"IF(K20=K21,\" \",IF(K20>K21,17,18))","v":17}]
[30,{"$f":"IF(ISBLANK($B$69),\"BYE\",$B$69)","v":"BYE"},null,{"$f":"IF($C$6=$C$7,\" \",IF($C$6<$C$7,$B$6,$B$7))","v":"BYE"},1,{"$f":"IF($G$14=$G$15,\" \",IF($G$14<$G$15,$F$14,$F$15))","v":"BYE"},1,{"$f":"IF($I$18=$I$19,\" \",IF($I$18<$I$19,$H$18,$H$19))","v":"BYE"},3,{"$f":"IF($I$22=$I$23,\" \",IF($I$22>$I$23,$H$22,$H$23))","v":" "},null,{"$f":"IF(K20=K21,\" \",IF(K20<K21,17,18))","v":18}]
[19,{"$f":"IF(ISBLANK($B$58),\"BYE\",$B$58)","v":"BYE"}]
[14,{"$f":"IF(ISBLANK($B$53),\"BYE\",$B$53)","v":"BYE"},"w.o."]
[11,{"$f":"IF(ISBLANK($B$50),\"BYE\",$B$50)","v":"BYE"},"w.o."]
[22,{"$f":"IF(ISBLANK($B$61),\"BYE\",$B$61)","v":"BYE"}]
[27,{"$f":"IF(ISBLANK($B$66),\"BYE\",$B$66)","v":"BYE"}]
[6,{"$f":"IF(ISBLANK($B$45),\"BYE\",$B$45)","v":"BYE"},"w.o."]
[7,{"$f":"IF(ISBLANK($B$46),\"BYE\",$B$46)","v":"BYE"},"w.o."]
[26,{"$f":"IF(ISBLANK($B$65),\"BYE\",$B$65)","v":"BYE"}]
[23,{"$f":"IF(ISBLANK($B$62),\"BYE\",$B$62)","v":"BYE"}]
[10,{"$f":"IF(ISBLANK($B$49),\"BYE\",$B$49)","v":"BYE"},"w.o."]
[15,{"$f":"IF(ISBLANK($B$54),\"BYE\",$B$54)","v":"BYE"},"w.o."]
[18,{"$f":"IF(ISBLANK($B$57),\"BYE\",$B$57)","v":"BYE"}]
[31,{"$f":"IF(ISBLANK($B$70),\"BYE\",$B$70)","v":"BYE"}]
[2,{"$f":"IF(ISBLANK($B$41),\"BYE\",$B$41)","v":"BYE"},"w.o."]
[3]
[]
[]
[null,{"$f":"B1","v":0}]
[1]
[2]
["3-4"]
["3-4"]
["5-8"]
["5-8"]
["5-8"]
["5-8"]
["9-16"]
["9-16"]
["9-16"]
["9-16"]
["9-16"]
["9-16"]
["9-16"]
["9-16"]
[17]
[18]
[19]
[20]
[21]
[22]
[23]
[24]
[25]
[26]
[27]
[28]
[29]
[30]
[31]
[32]

{"sheet":"Pavuk_18","index":11,"n_rows":59,"n_cols":12,"rows_kept":59,"hidden":true,"merged":[[1,1,1,11]]}
[null,"B15"]
[null,{"$f":"B1","v":"B15"}]
[]
[]
[null,"1.kolo",null,"2.kolo",null,"3.kolo",null,"4.kolo",null,"5.kolo"]
[1,{"$f":"IF(ISBLANK($B$42),\"BYE\",$B$42)","v":"BYE"},"w.o.",{"$f":"IF($C$6=$C$7,\" \",IF($C$6>$C$7,$B$6,$B$7))","v":"BYE"},null,{"$f":"IF($E$6=$E$7,\" \",IF($E$6>$E$7,$D$6,$D$7))","v":" "},null,{"$f":"IF($G$6=$G$7,\" \",IF($G$6>$G$7,$F$6,$F$7))","v":" "},null,{"$f":"IF($I$6=$I$7,\" \",IF($I$6>$I$7,$H$6,$H$7))","v":" "},null,{"$f":"IF(K6=K7,\" \",IF(K6>K7,1,2))","v":" "}]
[null,{"$f":"IF(ISBLANK($B$73),\"BYE\",$B$73)","v":"BYE"},null,{"$f":"IF($C$8=$C$9,\" \",IF($C$8>$C$9,$B$8,$B$9))","v":" "},null,{"$f":"IF($E$8=$E$9,\" \",IF($E$8>$E$9,$D$8,$D$9))","v":" "},null,{"$f":"IF($G$8=$G$9,\" \",IF($G$8>$G$9,$F$8,$F$9))","v":" "},null,{"$f":"IF($I$8=$I$9,\" \",IF($I$8>$I$9,$H$8,$H$9))","v":" "},null,{"$f":"IF(K6=K7,\" \",IF(K6<K7,1,2))","v":" "}]
["17-18",{"$f":"IF(ISBLANK($B$58),\"BYE\",$B$58)","v":"BYE"},null,{"$f":"IF($C$10=$C$11,\" \",IF($C$10>$C$11,$B$10,$B$11))","v":"BYE"},null,{"$f":"IF($E$10=$E$11,\" \",IF($E$10>$E$11,$D$10,$D$11))","v":" "},null,{"$f":"IF($G$10=$G$11,\" \",IF($G$10>$G$11,$F$10,$F11))","v":" "},null,{"$f":"IF($I$8=$I$9,\" \",IF($I$8<$I$9,$H$8,$H$9))","v":" "},null,{"$f":"IF(K8=K9,\" \",IF(K8>K9,3,4))","v":" "}]
["9-16",{"$f":"IF(ISBLANK($B$57),\"BYE\",$B$57)","v":"BYE"},null,{"$f":"IF($C$12=$C$13,\" \",IF($C$12>$C$13,$B$12,$B$13))","v":"BYE"},null,{"$f":"IF($E$12=$E$13,\" \",IF($E$12>$E$13,$D$12,$D$13))","v":" "},null,{"$f":"IF($G$12=$G$13,\" \",IF($G$12>$G$13,$F$12,$F$13))","v":" "},null,{"$f":"IF($I$6=$I$7,\" \",IF($I$6<$I$7,$H$6,$H$7))","v":" "},null,{"$f":"IF(K8=K9,\" \",IF(K8<K9,3,4))","v":" "}]
["9-16",{"$f":"IF(ISBLANK($B$50),\"BYE\",$B$50)","v":"BYE"},"w.o.",{"$f":"IF($C$14=$C$15,\" \",IF($C$14>$C$15,$B$14,$B$15))","v":"BYE"},null,{"$f":"IF($E$14=$E$15,\" \",IF($E$14>$E$15,$D$14,$D$15))","v":" "},null,{"$f":"IF($G$6=$G$7,\" \",IF($G$6<$G$7,$F$6,$F$7))","v":" "},null,{"$f":"IF($I$10=$I$11,\" \",IF($I$10>$I$11,$H$10,$H$11))","v":" "},null,{"$f":"IF(K10=K11,\" \",IF(K10>K11,5,6))","v":" "}]
[null,{"$f":"IF(ISBLANK($B$65),\"BYE\",$B$65)","v":"BYE"},null,{"$f":"IF($C$16=$C$17,\" \",IF($C$16>$C$17,$B$16,$B$17))","v":"BYE"},null,{"$f":"IF($E$16=$E$17,\" \",IF($E$16>$E$17,$D$16,$D$17))","v":" "},null,{"$f":"IF($G$8=$G$9,\" \",IF($G$8<$G$9,$F$8,$F$9))","v":" "},null,{"$f":"IF($I$12=$I$13,\" \",IF($I$12>$I$13,$H$12,$H$13))","v":" "},null,{"$f":"IF(K10=K11,\" \",IF(K10<K11,5,6))","v":" "}]
[null,{"$f":"IF(ISBLANK($B$66),\"BYE\",$B$66)","v":"BYE"},null,{"$f":"IF($C$18=$C$19,\" \",IF($C$18>$C$19,$B$18,$B$19))","v":"BYE"},null,{"$f":"IF($E$18=$E$19,\" \",IF($E$18>$E$19,$D$18,$D$19))","v":" "},null,{"$f":"IF($G$10=$G$11,\" \",IF($G$10<$G$11,$F$10,$F11))","v":" "},null,{"$f":"IF($I$10=$I$11,\" \",IF($I$10<$I$11,$H$10,$H$11))","v":" "},null,{"$f":"IF(K12=K13,\" \",IF(K12>K13,7,8))","v":" "}]
["5-8",{"$f":"IF(ISBLANK($B$49),\"BYE\",$B$49)","v":"BYE"},"w.o.",{"$f":"IF($C$20=$C$21,\" \",IF($C$20>$C$21,$B$20,$B$21))","v":"BYE"},null,{"$f":"IF($E$20=$E$21,\" \",IF($E$20>$E$21,$D$20,$D$21))","v":" "},null,{"$f":"IF($G$12=$G$13,\" \",IF($G$12<$G$13,$F$12,$F$13))","v":" "},null,{"$f":"IF($I$12=$I$13,\" \",IF($I$12<$I$13,$H$12,$H$13))","v":" "},null,{"$f":"IF(K12=K13,\" \",IF(K12<K13,7,8))","v":" "}]
["5-8",{"$f":"IF(ISBLANK($B$46),\"BYE\",$B$46)","v":"BYE"},"w.o.",{"$f":"IF($C$22=$C$23,\" \",IF($C$22>$C$23,$B$22,$B$23))","v":"BYE"},null,{"$f":"IF($E$6=$E$7,\" \",IF($E$6<$E$7,$D$6,$D$7))","v":" "},null,{"$f":"IF($G$14=$G$15,\" \",IF($G$14>$G$15,$F$14,$F$15))","v":" "},null,{"$f":"IF($I$14=$I$15,\" \",IF($I$14>$I$15,$H$14,$H$15))","v":" "},null,{"$f":"IF(K14=K15,\" \",IF(K14>K15,9,10))","v":" "}]
[null,{"$f":"IF(ISBLANK($B$69),\"BYE\",$B$69)","v":"BYE"},null,{"$f":"IF($C$24=$C$25,\" \",IF($C$24>$C$25,$B$24,$B25))","v":"BYE"},null,{"$f":"IF($E$10=$E$11,\" \",IF($E$10<$E$11,$D$10,$D$11))","v":" "},null,{"$f":"IF($G$16=$G$17,\" \",IF($G$16>$G$17,$F$16,$F$17))","v":" "},null,{"$f":"IF($I$16=$I$17,\" \",IF($I$16>$I$17,$H$16,$H$17))","v":" "},null,{"$f":"IF(K14=K15,\" \",IF(K14<K15,9,10))","v":" "}]
[null,{"$f":"IF(ISBLANK($B$62),\"BYE\",$B$62)","v":"BYE"},null,{"$f":"IF($C$26=$C$27,\" \",IF($C$26>$C$27,$B$26,$B$27))","v":"BYE"},null,{"$f":"IF($E$24=$E$25,\" \",IF($E$24>$E$25,$D$24,$D$25))","v":" "},null,{"$f":"IF($G$18=$G$19,\" \",IF($G$18>$G$19,$F$18,$F$19))","v":" "},null,{"$f":"IF($I$14=$I$15,\" \",IF($I$14<$I$15,$H$14,$H$15))","v":" "},null,{"$f":"IF(K16=K17,\" \",IF(K16>K17,11,12))","v":" "}]
["9-16",{"$f":"IF(ISBLANK($B$53),\"BYE\",$B$53)","v":"BYE"},"w.o.",{"$f":"IF($C$28=$C$29,\" \",IF($C$28>$C$29,$B$28,$B$29))","v":"BYE"},null,{"$f":"IF($E$12=$E$13,\" \",IF($E$12<$E$13,$D$12,$D$13))","v":" "},null,{"$f":"IF($G$20=$G$21,\" \",IF($G$20>$G$21,$F$20,$F$21))","v":" "},null,{"$f":"IF($I$16=$I$17,\" \",IF($I$16<$I$17,$H$16,$H$17))","v":" "},null,{"$f":"IF(K16=K17,\" \",IF(K16<K17,11,12))","v":" "}]
["9-16",{"$f":"IF(ISBLANK($B$54),\"BYE\",$B$54)","v":"BYE"},"w.o.",{"$f":"IF($C$30=$C$31,\" \",IF($C$30>$C$31,$B$30,$B$31))","v":"BYE"},null,{"$f":"IF($E$14=$E$15,\" \",IF($E$14<$E$15,$D$14,$D$15))","v":" "},null,{"$f":"IF($G$14=$G$15,\" \",IF($G$14<$G$15,$F$14,$F$15))","v":" "},null,{"$f":"IF($I$18=$I$19,\" \",IF($I$18>$I$19,$H$18,$H$19))","v":" "},null,{"$f":"IF(K18=K19,\" \",IF(K18>K19,13,14))","v":" "}]
[null,{"$f":"IF(ISBLANK($B$61),\"BYE\",$B$61)","v":"BYE"},null,{"$f":"IF($C$32=$C$33,\" \",IF($C$32>$C$33,$B$32,$B$33))","v":"BYE"},null,{"$f":"IF($E$22=$E$23,\" \",IF($E$22>$E$23,$D$22,$D$23))","v":" "},null,{"$f":"IF($G$16=$G$17,\" \",IF($G$16<$G$17,$F$16,$F$17))","v":" "},null,{"$f":"IF($I$20=$I$21,\" \",IF($I$20>$I$21,$H$20,$H$21))","v":" "},null,{"$f":"IF(K18=K19,\" \",IF(K18<K19,13,14))","v":" "}]
[null,{"$f":"IF(ISBLANK($B$70),\"BYE\",$B$70)","v":"BYE"},null,{"$f":"IF($C$34=$C$35,\" \",IF($C$34>$C$35,$B$34,$B$35))","v":" "},null,{"$f":"IF($E$16=$E$17,\" \",IF($E$16<$E$17,$D$16,$D$17))","v":" "},null,{"$f":"IF($G$18=$G$19,\" \",IF($G$18<$G$19,$F$18,$F$19))","v":" "},null,{"$f":"IF($I$18=$I$19,\" \",IF($I$18<$I$19,$H$18,$H$19))","v":" "},null,{"$f":"IF(K20=K21,\" \",IF(K20>K21,15,16))","v":" "}]
["3-4",{"$f":"IF(ISBLANK($B$45),\"BYE\",$B$45)","v":"BYE"},"w.o.",{"$f":"IF($C$36=$C$37,\" \",IF($C$36>$C$37,$B$36,$B$37))","v":"BYE"},null,{"$f":"IF($E$20=$E$21,\" \",IF($E$20<$E$21,$D$20,$D$21))","v":" "},null,{"$f":"IF($G$20=$G$21,\" \",IF($G$20<$G$21,$F$20,$F$21))","v":" "},null,{"$f":"IF($I$20=$I$21,\" \",IF($I$20<$I$21,$H$20,$H$21))","v":" "},null,{"$f":"IF(K20=K21,\" \",IF(K20<K21,15,16))","v":" "}]
["3-4",{"$f":"IF(ISBLANK($B$44),\"BYE\",$B$44)","v":"BYE"},"w.o.",{"$f":"IF($E$18=$E$19,\" \",IF($E$18<$E$19,$D$18,$D$19))","v":" "},null,{"$f":"IF($E$22=$E$23,\" \",IF($E$22>$E$23,$D$23,$D$22))","v":" "},null,{"$f":"IF($G$22=$G$23,\" \",IF($G$22>$G$23,$F$22,$F$23))","v":" "},null,{"$f":"H22","v":" "},null,{"$f":"IF(G22=G23,\" \",IF(G22>G23,17,18))","v":" "}]
[null,{"$f":"IF(ISBLANK($B$71),\"BYE\",$B$71)","v":"BYE"},null,{"$f":"IF($C$8=$C$9,\" \",IF($C$8<$C$9,$B$8,$B$9))","v":" "},null,{"$f":"IF($E$24=$E$25,\" \",IF($E$24>$E$25,$D$25,$D$24))","v":" "},null,{"$f":"IF($G$22=$G$23,\" \",IF($G$22>$G$23,$F$23,$F$22))","v":" "},null,{"$f":"H23","v":" "},null,{"$f":"IF(G22=G23,\" \",IF(G22<G23,17,18))","v":" "}]
[null,{"$f":"IF(ISBLANK($B$60),\"BYE\",$B$60)","v":"BYE"},null,{"$f":"IF($E$8=$E$9,\" \",IF($E$8<$E$9,$D$8,$D$9))","v":" "},null,{"$f":"IF($E$26=$E$27,\" \",IF($E$26>$E$27,$D$26,$D$27))","v":" "},null,{"$f":"IF($G$26=$G$27,\" \",IF($G$26>$G$27,$F$26,$F$27))","v":" "},null,{"$f":"IF($I$22=$I$23,\" \",IF($I$22<$I$23,$H$22,$H$23))","v":" "},null,{"$f":"IF(K24=K25,\" \",IF(K24>K25,19,20))","v":" "}]
["9-16",{"$f":"IF(ISBLANK($B$55),\"BYE\",$B$55)","v":"BYE"},"w.o.",{"$f":"IF($C$34=$C$35,\" \",IF($C$34<$C$35,$B$34,$B$35))","v":" "},null,{"$f":"IF($E$28=$E$29,\" \",IF($E$28>$E$29,$D$28,$D$29))","v":" "},null,{"$f":"IF($G$28=$G$29,\" \",IF($G$28>$G$29,$F$28,$F$29))","v":" "},null,{"$f":"IF($I$24=$I$25,\" \",IF($I$24<$I$25,$H$24,$H$25))","v":" "},null,{"$f":"IF(K24=K25,\" \",IF(K24<K25,19,20))","v":" "}]
["9-16",{"$f":"IF(ISBLANK($B$52),\"BYE\",$B$52)","v":"BYE"},"w.o."]
[null,{"$f":"IF(ISBLANK($B$63),\"BYE\",$B$63)","v":"BYE"}]
[null,{"$f":"IF(ISBLANK($B$68),\"BYE\",$B$68)","v":"BYE"}]
["5-8",{"$f":"IF(ISBLANK($B$47),\"BYE\",$B$47)","v":"BYE"},"w.o."]
["5-8",{"$f":"IF(ISBLANK($B$48),\"BYE\",$B$48)","v":"BYE"},"w.o."]
[null,{"$f":"IF(ISBLANK($B$67),\"BYE\",$B$67)","v":"BYE"}]
[null,{"$f":"IF(ISBLANK($B$64),\"BYE\",$B$64)","v":"BYE"}]
["9-16",{"$f":"IF(ISBLANK($B$51),\"BYE\",$B$51)","v":"BYE"},"w.o."]
["9-16",{"$f":"IF(ISBLANK($B$56),\"BYE\",$B$56)","v":"BYE"}]
["17-18",{"$f":"IF(ISBLANK($B$59),\"BYE\",$B$59)","v":"BYE"}]
[null,{"$f":"IF(ISBLANK($B$72),\"BYE\",$B$72)","v":"BYE"}]
[2,{"$f":"IF(ISBLANK($B$43),\"BYE\",$B$43)","v":"BYE"},"w.o."]
[3]
[]
[]
[null,{"$f":"B1","v":"B15"}]
[1]
[2]
["3-4"]
["3-4"]
["5-8"]
["5-8"]
["5-8"]
["5-8"]
["9-16"]
["9-16"]
["9-16"]
["9-16"]
["9-16"]
["9-16"]
["9-16"]
["9-16"]
["17-18"]
["17-18"]

{"sheet":"Pavuk_23","index":12,"n_rows":64,"n_cols":12,"rows_kept":64,"hidden":true,"merged":[[1,1,1,11]]}
[null,"B17"]
[null,{"$f":"B1","v":"B17"}]
[]
[]
[null,"1.kolo",null,"2.kolo",null,"3.kolo",null,"4.kolo",null,"5.kolo"]
[1,{"$f":"IF(ISBLANK($B$42),\"BYE\",$B$42)","v":"BYE"},"w.o",{"$f":"IF($C$6=$C$7,\" \",IF($C$6>$C$7,$B$6,$B$7))","v":"BYE"},null,{"$f":"IF($E$6=$E$7,\" \",IF($E$6>$E$7,$D$6,$D$7))","v":" "},null,{"$f":"IF($G$6=$G$7,\" \",IF($G$6>$G$7,$F$6,$F$7))","v":" "},null,{"$f":"IF($I$6=$I$7,\" \",IF($I$6>$I$7,$H$6,$H$7))","v":" "},null,{"$f":"IF(K6=K7,\" \",IF(K6>K7,1,2))","v":" "}]
[null,{"$f":"IF(ISBLANK($B$73),\"BYE\",$B$73)","v":"BYE"},null,{"$f":"IF($C$8=$C$9,\" \",IF($C$8>$C$9,$B$8,$B$9))","v":" "},null,{"$f":"IF($E$8=$E$9,\" \",IF($E$8>$E$9,$D$8,$D$9))","v":" "},null,{"$f":"IF($G$8=$G$9,\" \",IF($G$8>$G$9,$F$8,$F$9))","v":" "},null,{"$f":"IF($I$8=$I$9,\" \",IF($I$8>$I$9,$H$8,$H$9))","v":" "},null,{"$f":"IF(K6=K7,\" \",IF(K6<K7,1,2))","v":" "}]
["17-23",{"$f":"IF(ISBLANK($B$58),\"BYE\",$B$58)","v":"BYE"},null,{"$f":"IF($C$10=$C$11,\" \",IF($C$10>$C$11,$B$10,$B$11))","v":"BYE"},null,{"$f":"IF($E$10=$E$11,\" \",IF($E$10>$E$11,$D$10,$D$11))","v":" "},null,{"$f":"IF($G$10=$G$11,\" \",IF($G$10>$G$11,$F$10,$F11))","v":" "},null,{"$f":"IF($I$8=$I$9,\" \",IF($I$8<$I$9,$H$8,$H$9))","v":" "},null,{"$f":"IF(K8=K9,\" \",IF(K8>K9,3,4))","v":" "}]
["9-16",{"$f":"IF(ISBLANK($B$57),\"BYE\",$B$57)","v":"BYE"},null,{"$f":"IF($C$12=$C$13,\" \",IF($C$12>$C$13,$B$12,$B$13))","v":"BYE"},null,{"$f":"IF($E$12=$E$13,\" \",IF($E$12>$E$13,$D$12,$D$13))","v":" "},null,{"$f":"IF($G$12=$G$13,\" \",IF($G$12>$G$13,$F$12,$F$13))","v":" "},null,{"$f":"IF($I$6=$I$7,\" \",IF($I$6<$I$7,$H$6,$H$7))","v":" "},null,{"$f":"IF(K8=K9,\" \",IF(K8<K9,3,4))","v":" "}]
["9-16",{"$f":"IF(ISBLANK($B$50),\"BYE\",$B$50)","v":"BYE"},"w.o",{"$f":"IF($C$14=$C$15,\" \",IF($C$14>$C$15,$B$14,$B$15))","v":"BYE"},null,{"$f":"IF($E$14=$E$15,\" \",IF($E$14>$E$15,$D$14,$D$15))","v":" "},null,{"$f":"IF($G$6=$G$7,\" \",IF($G$6<$G$7,$F$6,$F$7))","v":" "},null,{"$f":"IF($I$10=$I$11,\" \",IF($I$10>$I$11,$H$10,$H$11))","v":" "},null,{"$f":"IF(K10=K11,\" \",IF(K10>K11,5,6))","v":" "}]
[null,{"$f":"IF(ISBLANK($B$65),\"BYE\",$B$65)","v":"BYE"},null,{"$f":"IF($C$16=$C$17,\" \",IF($C$16>$C$17,$B$16,$B$17))","v":" "},null,{"$f":"IF($E$16=$E$17,\" \",IF($E$16>$E$17,$D$16,$D$17))","v":" "},null,{"$f":"IF($G$8=$G$9,\" \",IF($G$8<$G$9,$F$8,$F$9))","v":" "},null,{"$f":"IF($I$12=$I$13,\" \",IF($I$12>$I$13,$H$12,$H$13))","v":" "},null,{"$f":"IF(K10=K11,\" \",IF(K10<K11,5,6))","v":" "}]
[null,{"$f":"IF(ISBLANK($B$66),\"BYE\",$B$66)","v":"BYE"},null,{"$f":"IF($C$18=$C$19,\" \",IF($C$18>$C$19,$B$18,$B$19))","v":" "},null,{"$f":"IF($E$18=$E$19,\" \",IF($E$18>$E$19,$D$18,$D$19))","v":" "},null,{"$f":"IF($G$10=$G$11,\" \",IF($G$10<$G$11,$F$10,$F11))","v":" "},null,{"$f":"IF($I$10=$I$11,\" \",IF($I$10<$I$11,$H$10,$H$11))","v":" "},null,{"$f":"IF(K12=K13,\" \",IF(K12>K13,7,8))","v":" "}]
["5-8",{"$f":"IF(ISBLANK($B$49),\"BYE\",$B$49)","v":"BYE"},"w.o",{"$f":"IF($C$20=$C$21,\" \",IF($C$20>$C$21,$B$20,$B$21))","v":"BYE"},null,{"$f":"IF($E$20=$E$21,\" \",IF($E$20>$E$21,$D$20,$D$21))","v":" "},null,{"$f":"IF($G$12=$G$13,\" \",IF($G$12<$G$13,$F$12,$F$13))","v":" "},null,{"$f":"IF($I$12=$I$13,\" \",IF($I$12<$I$13,$H$12,$H$13))","v":" "},null,{"$f":"IF(K12=K13,\" \",IF(K12<K13,7,8))","v":" "}]
["5-8",{"$f":"IF(ISBLANK($B$46),\"BYE\",$B$46)","v":"BYE"},"w.o",{"$f":"IF($C$22=$C$23,\" \",IF($C$22>$C$23,$B$22,$B$23))","v":"BYE"},null,{"$f":"IF($E$6=$E$7,\" \",IF($E$6<$E$7,$D$6,$D$7))","v":" "},null,{"$f":"IF($G$14=$G$15,\" \",IF($G$14>$G$15,$F$14,$F$15))","v":" "},null,{"$f":"IF($I$14=$I$15,\" \",IF($I$14>$I$15,$H$14,$H$15))","v":" "},null,{"$f":"IF(K14=K15,\" \",IF(K14>K15,9,10))","v":" "}]
[null,{"$f":"IF(ISBLANK($B$69),\"BYE\",$B$69)","v":"BYE"},null,{"$f":"IF($C$24=$C$25,\" \",IF($C$24>$C$25,$B$24,$B25))","v":" "},null,{"$f":"IF($E$8=$E$9,\" \",IF($E$8<$E$9,$D$8,$D$9))","v":" "},null,{"$f":"IF($G$16=$G$17,\" \",IF($G$16>$G$17,$F$16,$F$17))","v":" "},null,{"$f":"IF($I$16=$I$17,\" \",IF($I$16>$I$17,$H$16,$H$17))","v":" "},null,{"$f":"IF(K14=K15,\" \",IF(K14<K15,9,10))","v":" "}]
["17-23",{"$f":"IF(ISBLANK($B$62),\"BYE\",$B$62)","v":"BYE"},null,{"$f":"IF($C$26=$C$27,\" \",IF($C$26>$C$27,$B$26,$B$27))","v":" "},null,{"$f":"IF($E$10=$E$11,\" \",IF($E$10<$E$11,$D$10,$D$11))","v":" "},null,{"$f":"IF($G$18=$G$19,\" \",IF($G$18>$G$19,$F$18,$F$19))","v":" "},null,{"$f":"IF($I$14=$I$15,\" \",IF($I$14<$I$15,$H$14,$H$15))","v":" "},null,{"$f":"IF(K16=K17,\" \",IF(K16>K17,11,12))","v":" "}]
["9-16",{"$f":"IF(ISBLANK($B$53),\"BYE\",$B$53)","v":"BYE"},null,{"$f":"IF($C$28=$C$29,\" \",IF($C$28>$C$29,$B$28,$B$29))","v":"BYE"},null,{"$f":"IF($E$12=$E$13,\" \",IF($E$12<$E$13,$D$12,$D$13))","v":" "},null,{"$f":"IF($G$20=$G$21,\" \",IF($G$20>$G$21,$F$20,$F$21))","v":" "},null,{"$f":"IF($I$16=$I$17,\" \",IF($I$16<$I$17,$H$16,$H$17))","v":" "},null,{"$f":"IF(K16=K17,\" \",IF(K16<K17,11,12))","v":" "}]
["9-16",{"$f":"IF(ISBLANK($B$54),\"BYE\",$B$54)","v":"BYE"},null,{"$f":"IF($C$30=$C$31,\" \",IF($C$30>$C$31,$B$30,$B$31))","v":"BYE"},null,{"$f":"IF($E$14=$E$15,\" \",IF($E$14<$E$15,$D$14,$D$15))","v":" "},null,{"$f":"IF($G$14=$G$15,\" \",IF($G$14<$G$15,$F$14,$F$15))","v":" "},null,{"$f":"IF($I$18=$I$19,\" \",IF($I$18>$I$19,$H$18,$H$19))","v":" "},null,{"$f":"IF(K18=K19,\" \",IF(K18>K19,13,14))","v":" "}]
["17-23",{"$f":"IF(ISBLANK($B$61),\"BYE\",$B$61)","v":"BYE"},null,{"$f":"IF($C$32=$C$33,\" \",IF($C$32>$C$33,$B$32,$B$33))","v":" "},null,{"$f":"IF($E$16=$E$17,\" \",IF($E$16<$E$17,$D$16,$D$17))","v":" "},null,{"$f":"IF($G$16=$G$17,\" \",IF($G$16<$G$17,$F$16,$F$17))","v":" "},null,{"$f":"IF($I$20=$I$21,\" \",IF($I$20>$I$21,$H$20,$H$21))","v":" "},null,{"$f":"IF(K18=K19,\" \",IF(K18<K19,13,14))","v":" "}]
[null,{"$f":"IF(ISBLANK($B$70),\"BYE\",$B$70)","v":"BYE"},null,{"$f":"IF($C$34=$C$35,\" \",IF($C$34>$C$35,$B$34,$B$35))","v":" "},null,{"$f":"IF($E$18=$E$19,\" \",IF($E$18<$E$19,$D$18,$D$19))","v":" "},null,{"$f":"IF($G$18=$G$19,\" \",IF($G$18<$G$19,$F$18,$F$19))","v":" "},null,{"$f":"IF($I$18=$I$19,\" \",IF($I$18<$I$19,$H$18,$H$19))","v":" "},null,{"$f":"IF(K20=K21,\" \",IF(K20>K21,15,16))","v":" "}]
["3-4",{"$f":"IF(ISBLANK($B$45),\"BYE\",$B$45)","v":"BYE"},"w.o",{"$f":"IF($C$36=$C$37,\" \",IF($C$36>$C$37,$B$36,$B$37))","v":"BYE"},null,{"$f":"IF($E$20=$E$21,\" \",IF($E$20<$E$21,$D$20,$D$21))","v":" "},null,{"$f":"IF($G$20=$G$21,\" \",IF($G$20<$G$21,$F$20,$F$21))","v":" "},null,{"$f":"IF($I$20=$I$21,\" \",IF($I$20<$I$21,$H$20,$H$21))","v":" "},null,{"$f":"IF(K20=K21,\" \",IF(K20<K21,15,16))","v":" "}]
["3-4",{"$f":"IF(ISBLANK($B$44),\"BYE\",$B$44)","v":"BYE"},"w.o",{"$f":"IF($C$6=$C$7,\" \",IF($C$6<$C$7,$B$6,$B$7))","v":"BYE"},null,{"$f":"IF($E$22=$E$23,\" \",IF($E$22>$E$23,$D$22,$D$23))","v":" "},"w.o",{"$f":"IF($G$22=$G$23,\" \",IF($G$22>$G$23,$F$22,$F$23))","v":" "},null,{"$f":"IF($I$22=$I$23,\" \",IF($I$22>$I$23,$H$22,$H$23))","v":" "},null,{"$f":"IF(K22=K23,\" \",IF(K22>K23,17,18))","v":" "}]
[null,{"$f":"IF(ISBLANK($B$71),\"BYE\",$B$71)","v":"BYE"},null,{"$f":"IF($C$8=$C$9,\" \",IF($C$8<$C$9,$B$8,$B$9))","v":" "},"w.o",{"$f":"IF($E$24=$E$25,\" \",IF($E$24>$E$25,$D$24,$D$25))","v":"BYE"},null,{"$f":"IF($G$24=$G$25,\" \",IF($G$24>$G$25,$F$24,$F$25))","v":" "},null,{"$f":"IF($I$24=$I$25,\" \",IF($I$24>$I$25,$H$24,$H$25))","v":" "},null,{"$f":"IF(K22=K23,\" \",IF(K22<K23,17,18))","v":" "}]
["17-23",{"$f":"IF(ISBLANK($B$60),\"BYE\",$B$60)","v":"BYE"},null,{"$f":"IF($C$10=$C$11,\" \",IF($C$10<$C$11,$B$10,$B$11))","v":"BYE"},"w.o",{"$f":"IF($E$26=$E$27,\" \",IF($E$26>$E$27,$D$26,$D$27))","v":" "},null,{"$f":"IF($G$26=$G$27,\" \",IF($G$26>$G$27,$F$26,$F$27))","v":" "},null,{"$f":"IF($I$22=$I$23,\" \",IF($I$22<$I$23,$H$22,$H$23))","v":" "},null,{"$f":"IF(K24=K25,\" \",IF(K24>K25,19,20))","v":" "}]
["9-16",{"$f":"IF(ISBLANK($B$55),\"BYE\",$B$55)","v":"BYE"},null,{"$f":"IF($C$12=$C$13,\" \",IF($C$12<$C$13,$B$12,$B$13))","v":"BYE"},null,{"$f":"IF($E$28=$E$29,\" \",IF($E$28>$E$29,$D$28,$D$29))","v":" "},null,{"$f":"IF($G$28=$G$29,\" \",IF($G$28>$G$29,$F$28,$F$29))","v":" "},null,{"$f":"IF($I$24=$I$25,\" \",IF($I$24<$I$25,$H$24,$H$25))","v":" "},null,{"$f":"IF(K24=K25,\" \",IF(K24<K25,19,20))","v":" "}]
["9-16",{"$f":"IF(ISBLANK($B$52),\"BYE\",$B$52)","v":"BYE"},null,{"$f":"IF($C$14=$C$15,\" \",IF($C$14<$C$15,$B$14,$B$15))","v":"BYE"},null,{"$f":"IF($E$30=$E$31,\" \",IF($E$30>$E$31,$D$30,$D$31))","v":" "},null,{"$f":"IF($G$22=$G$23,\" \",IF($G$22<$G$23,$F$22,$F$23))","v":"BYE"},null,{"$f":"IF($I$26=$I$27,\" \",IF($I$26>$I$27,$H$26,$H$27))","v":" "},null,{"$f":"IF(K26=K27,\" \",IF(K26>K27,21,22))","v":" "}]
["17-23",{"$f":"IF(ISBLANK($B$63),\"BYE\",$B$63)","v":"BYE"},null,{"$f":"IF($C$16=$C$17,\" \",IF($C$16<$C$17,$B$16,$B$17))","v":" "},"w.o",{"$f":"IF($E$32=$E$33,\" \",IF($E$32>$E$33,$D$32,$D$33))","v":" "},null,{"$f":"IF($G$24=$G$25,\" \",IF($G$24<$G$25,$F$24,$F$25))","v":" "},"w.o",{"$f":"IF($I$28=$I$29,\" \",IF($I$28>$I$29,$H$28,$H$29))","v":" "},null,{"$f":"IF(K26=K27,\" \",IF(K26<K27,21,22))","v":" "}]
[null,{"$f":"IF(ISBLANK($B$68),\"BYE\",$B$68)","v":"BYE"},null,{"$f":"IF($C$18=$C$19,\" \",IF($C$18<$C$19,$B$18,$B$19))","v":" "},"w.o",{"$f":"IF($E$34=$E$35,\" \",IF($E$34>$E$35,$D$34,$D$35))","v":" "},null,{"$f":"IF($G$26=$G$27,\" \",IF($G$26<$G$27,$F$26,$F$27))","v":" "},null,{"$f":"IF($I$28=$I$29,\" \",IF($I$28<$I$29,$H$28,$H$29))","v":" "},"w.o",{"$f":"IF(K28=K29,\" \",IF(K28>K29,23,24))","v":23}]
["5-8",{"$f":"IF(ISBLANK($B$47),\"BYE\",$B$47)","v":"BYE"},"w.o",{"$f":"IF($C$20=$C$21,\" \",IF($C$20<$C$21,$B$20,$B$21))","v":"BYE"},null,{"$f":"IF($E$36=$E$37,\" \",IF($E$36>$E$37,$D$36,$D$37))","v":" "},null,{"$f":"IF($G$28=$G$29,\" \",IF($G$28<$G$29,$F$28,$F$29))","v":" "},null,{"$f":"IF($I$28=$I$29,\" \",IF($I$28<$I$29,$H$28,$H$29))","v":" "},null,{"$f":"IF(K28=K29,\" \",IF(K28<K29,23,24))","v":24}]
["5-8",{"$f":"IF(ISBLANK($B$48),\"BYE\",$B$48)","v":"BYE"},"w.o",{"$f":"IF($C$22=$C$23,\" \",IF($C$22<$C$23,$B$22,$B$23))","v":"BYE"}]
[null,{"$f":"IF(ISBLANK($B$67),\"BYE\",$B$67)","v":"BYE"},null,{"$f":"IF($C$24=$C$25,\" \",IF($C$24<$C$25,$B$24,$B25))","v":" "},"w.o"]
["17-23",{"$f":"IF(ISBLANK($B$64),\"BYE\",$B$64)","v":"BYE"},null,{"$f":"IF($C$26=$C$27,\" \",IF($C$26<$C$27,$B$26,$B$27))","v":" "},"w.o"]
["9-16",{"$f":"IF(ISBLANK($B$51),\"BYE\",$B$51)","v":"BYE"},null,{"$f":"IF($C$28=$C$29,\" \",IF($C$28<$C$29,$B$28,$B$29))","v":"BYE"}]
["9-16",{"$f":"IF(ISBLANK($B$56),\"BYE\",$B$56)","v":"BYE"},null,{"$f":"IF($C$30=$C$31,\" \",IF($C$30<$C$31,$B$30,$B$31))","v":"BYE"}]
["17-23",{"$f":"IF(ISBLANK($B$59),\"BYE\",$B$59)","v":"BYE"},null,{"$f":"IF($C$32=$C$33,\" \",IF($C$32<$C$33,$B$32,$B$33))","v":" "},"w.o"]
[null,{"$f":"IF(ISBLANK($B$72),\"BYE\",$B$72)","v":"BYE"},null,{"$f":"IF($C$34=$C$35,\" \",IF($C$34<$C$35,$B$34,$B$35))","v":" "},"w.o"]
[2,{"$f":"IF(ISBLANK($B$43),\"BYE\",$B$43)","v":"BYE"},"w.o",{"$f":"IF($C$36=$C$37,\" \",IF($C$36<$C$37,$B$36,$B$37))","v":"BYE"}]
[3]
[]
[]
[null,{"$f":"B1","v":"B17"}]
[1]
[2]
["3-4"]
["3-4"]
["5-8"]
["5-8"]
["5-8"]
["5-8"]
["9-16"]
["9-16"]
["9-16"]
["9-16"]
["9-16"]
["9-16"]
["9-16"]
["9-16"]
["17-23"]
["17-23"]
["17-23"]
["17-23"]
["17-23"]
["17-23"]
["17-23"]

{"sheet":"pavúk_32","index":13,"n_rows":73,"n_cols":12,"rows_kept":73,"hidden":true,"merged":[[1,1,1,11]]}
[]
[null,{"$f":"B1","v":0}]
[]
[]
[null,"1.kolo",null,"2.kolo",null,"3.kolo",null,"4.kolo",null,"5.kolo"]
[1,{"$f":"IF(ISBLANK($B$42),\"BYE\",$B$42)","v":"BYE"},null,{"$f":"IF($C$6=$C$7,\" \",IF($C$6>$C$7,$B$6,$B$7))","v":" "},null,{"$f":"IF($E$6=$E$7,\" \",IF($E$6>$E$7,$D$6,$D$7))","v":" "},null,{"$f":"IF($G$6=$G$7,\" \",IF($G$6>$G$7,$F$6,$F$7))","v":" "},null,{"$f":"IF($I$6=$I$7,\" \",IF($I$6>$I$7,$H$6,$H$7))","v":" "},null,{"$f":"IF(K6=K7,\" \",IF(K6>K7,1,2))","v":" "}]
[32,{"$f":"IF(ISBLANK($B$73),\"BYE\",$B$73)","v":"BYE"},null,{"$f":"IF($C$8=$C$9,\" \",IF($C$8>$C$9,$B$8,$B$9))","v":" "},null,{"$f":"IF($E$8=$E$9,\" \",IF($E$8>$E$9,$D$8,$D$9))","v":" "},null,{"$f":"IF($G$8=$G$9,\" \",IF($G$8>$G$9,$F$8,$F$9))","v":" "},null,{"$f":"IF($I$8=$I$9,\" \",IF($I$8>$I$9,$H$8,$H$9))","v":" "},null,{"$f":"IF(K6=K7,\" \",IF(K6<K7,1,2))","v":" "}]
[17,{"$f":"IF(ISBLANK($B$58),\"BYE\",$B$58)","v":"BYE"},null,{"$f":"IF($C$10=$C$11,\" \",IF($C$10>$C$11,$B$10,$B$11))","v":" "},null,{"$f":"IF($E$10=$E$11,\" \",IF($E$10>$E$11,$D$10,$D$11))","v":" "},null,{"$f":"IF($G$10=$G$11,\" \",IF($G$10>$G$11,$F$10,$F11))","v":" "},null,{"$f":"IF($I$8=$I$9,\" \",IF($I$8<$I$9,$H$8,$H$9))","v":" "},null,{"$f":"IF(K8=K9,\" \",IF(K8>K9,3,4))","v":" "}]
[16,{"$f":"IF(ISBLANK($B$57),\"BYE\",$B$57)","v":"BYE"},null,{"$f":"IF($C$12=$C$13,\" \",IF($C$12>$C$13,$B$12,$B$13))","v":" "},null,{"$f":"IF($E$12=$E$13,\" \",IF($E$12>$E$13,$D$12,$D$13))","v":" "},null,{"$f":"IF($G$12=$G$13,\" \",IF($G$12>$G$13,$F$12,$F$13))","v":" "},null,{"$f":"IF($I$6=$I$7,\" \",IF($I$6<$I$7,$H$6,$H$7))","v":" "},null,{"$f":"IF(K8=K9,\" \",IF(K8<K9,3,4))","v":" "}]
[9,{"$f":"IF(ISBLANK($B$50),\"BYE\",$B$50)","v":"BYE"},null,{"$f":"IF($C$14=$C$15,\" \",IF($C$14>$C$15,$B$14,$B$15))","v":" "},null,{"$f":"IF($E$14=$E$15,\" \",IF($E$14>$E$15,$D$14,$D$15))","v":" "},null,{"$f":"IF($G$6=$G$7,\" \",IF($G$6<$G$7,$F$6,$F$7))","v":" "},null,{"$f":"IF($I$10=$I$11,\" \",IF($I$10>$I$11,$H$10,$H$11))","v":" "},null,{"$f":"IF(K10=K11,\" \",IF(K10>K11,5,6))","v":" "}]
[24,{"$f":"IF(ISBLANK($B$65),\"BYE\",$B$65)","v":"BYE"},null,{"$f":"IF($C$16=$C$17,\" \",IF($C$16>$C$17,$B$16,$B$17))","v":" "},null,{"$f":"IF($E$16=$E$17,\" \",IF($E$16>$E$17,$D$16,$D$17))","v":" "},null,{"$f":"IF($G$8=$G$9,\" \",IF($G$8<$G$9,$F$8,$F$9))","v":" "},null,{"$f":"IF($I$12=$I$13,\" \",IF($I$12>$I$13,$H$12,$H$13))","v":" "},null,{"$f":"IF(K10=K11,\" \",IF(K10<K11,5,6))","v":" "}]
[25,{"$f":"IF(ISBLANK($B$66),\"BYE\",$B$66)","v":"BYE"},null,{"$f":"IF($C$18=$C$19,\" \",IF($C$18>$C$19,$B$18,$B$19))","v":" "},null,{"$f":"IF($E$18=$E$19,\" \",IF($E$18>$E$19,$D$18,$D$19))","v":" "},null,{"$f":"IF($G$10=$G$11,\" \",IF($G$10<$G$11,$F$10,$F11))","v":" "},null,{"$f":"IF($I$10=$I$11,\" \",IF($I$10<$I$11,$H$10,$H$11))","v":" "},null,{"$f":"IF(K12=K13,\" \",IF(K12>K13,7,8))","v":" "}]
[8,{"$f":"IF(ISBLANK($B$49),\"BYE\",$B$49)","v":"BYE"},null,{"$f":"IF($C$20=$C$21,\" \",IF($C$20>$C$21,$B$20,$B$21))","v":" "},null,{"$f":"IF($E$20=$E$21,\" \",IF($E$20>$E$21,$D$20,$D$21))","v":" "},null,{"$f":"IF($G$12=$G$13,\" \",IF($G$12<$G$13,$F$12,$F$13))","v":" "},null,{"$f":"IF($I$12=$I$13,\" \",IF($I$12<$I$13,$H$12,$H$13))","v":" "},null,{"$f":"IF(K12=K13,\" \",IF(K12<K13,7,8))","v":" "}]
[5,{"$f":"IF(ISBLANK($B$46),\"BYE\",$B$46)","v":"BYE"},null,{"$f":"IF($C$22=$C$23,\" \",IF($C$22>$C$23,$B$22,$B$23))","v":" "},null,{"$f":"IF($E$6=$E$7,\" \",IF($E$6<$E$7,$D$6,$D$7))","v":" "},null,{"$f":"IF($G$14=$G$15,\" \",IF($G$14>$G$15,$F$14,$F$15))","v":" "},null,{"$f":"IF($I$14=$I$15,\" \",IF($I$14>$I$15,$H$14,$H$15))","v":" "},null,{"$f":"IF(K14=K15,\" \",IF(K14>K15,9,10))","v":" "}]
[28,{"$f":"IF(ISBLANK($B$69),\"BYE\",$B$69)","v":"BYE"},null,{"$f":"IF($C$24=$C$25,\" \",IF($C$24>$C$25,$B$24,$B25))","v":" "},null,{"$f":"IF($E$8=$E$9,\" \",IF($E$8<$E$9,$D$8,$D$9))","v":" "},null,{"$f":"IF($G$16=$G$17,\" \",IF($G$16>$G$17,$F$16,$F$17))","v":" "},null,{"$f":"IF($I$16=$I$17,\" \",IF($I$16>$I$17,$H$16,$H$17))","v":" "},null,{"$f":"IF(K14=K15,\" \",IF(K14<K15,9,10))","v":" "}]
[21,{"$f":"IF(ISBLANK($B$62),\"BYE\",$B$62)","v":"BYE"},null,{"$f":"IF($C$26=$C$27,\" \",IF($C$26>$C$27,$B$26,$B$27))","v":" "},null,{"$f":"IF($E$10=$E$11,\" \",IF($E$10<$E$11,$D$10,$D$11))","v":" "},null,{"$f":"IF($G$18=$G$19,\" \",IF($G$18>$G$19,$F$18,$F$19))","v":" "},null,{"$f":"IF($I$14=$I$15,\" \",IF($I$14<$I$15,$H$14,$H$15))","v":" "},null,{"$f":"IF(K16=K17,\" \",IF(K16>K17,11,12))","v":" "}]
[12,{"$f":"IF(ISBLANK($B$53),\"BYE\",$B$53)","v":"BYE"},null,{"$f":"IF($C$28=$C$29,\" \",IF($C$28>$C$29,$B$28,$B$29))","v":" "},null,{"$f":"IF($E$12=$E$13,\" \",IF($E$12<$E$13,$D$12,$D$13))","v":" "},null,{"$f":"IF($G$20=$G$21,\" \",IF($G$20>$G$21,$F$20,$F$21))","v":" "},null,{"$f":"IF($I$16=$I$17,\" \",IF($I$16<$I$17,$H$16,$H$17))","v":" "},null,{"$f":"IF(K16=K17,\" \",IF(K16<K17,11,12))","v":" "}]
[13,{"$f":"IF(ISBLANK($B$54),\"BYE\",$B$54)","v":"BYE"},null,{"$f":"IF($C$30=$C$31,\" \",IF($C$30>$C$31,$B$30,$B$31))","v":" "},null,{"$f":"IF($E$14=$E$15,\" \",IF($E$14<$E$15,$D$14,$D$15))","v":" "},null,{"$f":"IF($G$14=$G$15,\" \",IF($G$14<$G$15,$F$14,$F$15))","v":" "},null,{"$f":"IF($I$18=$I$19,\" \",IF($I$18>$I$19,$H$18,$H$19))","v":" "},null,{"$f":"IF(K18=K19,\" \",IF(K18>K19,13,14))","v":" "}]
[20,{"$f":"IF(ISBLANK($B$61),\"BYE\",$B$61)","v":"BYE"},null,{"$f":"IF($C$32=$C$33,\" \",IF($C$32>$C$33,$B$32,$B$33))","v":" "},null,{"$f":"IF($E$16=$E$17,\" \",IF($E$16<$E$17,$D$16,$D$17))","v":" "},null,{"$f":"IF($G$16=$G$17,\" \",IF($G$16<$G$17,$F$16,$F$17))","v":" "},null,{"$f":"IF($I$20=$I$21,\" \",IF($I$20>$I$21,$H$20,$H$21))","v":" "},null,{"$f":"IF(K18=K19,\" \",IF(K18<K19,13,14))","v":" "}]
[29,{"$f":"IF(ISBLANK($B$70),\"BYE\",$B$70)","v":"BYE"},null,{"$f":"IF($C$34=$C$35,\" \",IF($C$34>$C$35,$B$34,$B$35))","v":" "},null,{"$f":"IF($E$18=$E$19,\" \",IF($E$18<$E$19,$D$18,$D$19))","v":" "},null,{"$f":"IF($G$18=$G$19,\" \",IF($G$18<$G$19,$F$18,$F$19))","v":" "},null,{"$f":"IF($I$18=$I$19,\" \",IF($I$18<$I$19,$H$18,$H$19))","v":" "},null,{"$f":"IF(K20=K21,\" \",IF(K20>K21,15,16))","v":" "}]
[4,{"$f":"IF(ISBLANK($B$45),\"BYE\",$B$45)","v":"BYE"},null,{"$f":"IF($C$36=$C$37,\" \",IF($C$36>$C$37,$B$36,$B$37))","v":" "},null,{"$f":"IF($E$20=$E$21,\" \",IF($E$20<$E$21,$D$20,$D$21))","v":" "},null,{"$f":"IF($G$20=$G$21,\" \",IF($G$20<$G$21,$F$20,$F$21))","v":" "},null,{"$f":"IF($I$20=$I$21,\" \",IF($I$20<$I$21,$H$20,$H$21))","v":" "},null,{"$f":"IF(K20=K21,\" \",IF(K20<K21,15,16))","v":" "}]
[3,{"$f":"IF(ISBLANK($B$44),\"BYE\",$B$44)","v":"BYE"},null,{"$f":"IF($C$6=$C$7,\" \",IF($C$6<$C$7,$B$6,$B$7))","v":" "},null,{"$f":"IF($E$22=$E$23,\" \",IF($E$22>$E$23,$D$22,$D$23))","v":" "},null,{"$f":"IF($G$22=$G$23,\" \",IF($G$22>$G$23,$F$22,$F$23))","v":" "},null,{"$f":"IF($I$22=$I$23,\" \",IF($I$22>$I$23,$H$22,$H$23))","v":" "},null,{"$f":"IF(K22=K23,\" \",IF(K22>K23,17,18))","v":" "}]
[30,{"$f":"IF(ISBLANK($B$71),\"BYE\",$B$71)","v":"BYE"},null,{"$f":"IF($C$8=$C$9,\" \",IF($C$8<$C$9,$B$8,$B$9))","v":" "},null,{"$f":"IF($E$24=$E$25,\" \",IF($E$24>$E$25,$D$24,$D$25))","v":" "},null,{"$f":"IF($G$24=$G$25,\" \",IF($G$24>$G$25,$F$24,$F$25))","v":" "},null,{"$f":"IF($I$24=$I$25,\" \",IF($I$24>$I$25,$H$24,$H$25))","v":" "},null,{"$f":"IF(K22=K23,\" \",IF(K22<K23,17,18))","v":" "}]
[19,{"$f":"IF(ISBLANK($B$60),\"BYE\",$B$60)","v":"BYE"},null,{"$f":"IF($C$10=$C$11,\" \",IF($C$10<$C$11,$B$10,$B$11))","v":" "},null,{"$f":"IF($E$26=$E$27,\" \",IF($E$26>$E$27,$D$26,$D$27))","v":" "},null,{"$f":"IF($G$26=$G$27,\" \",IF($G$26>$G$27,$F$26,$F$27))","v":" "},null,{"$f":"IF($I$22=$I$23,\" \",IF($I$22<$I$23,$H$22,$H$23))","v":" "},null,{"$f":"IF(K24=K25,\" \",IF(K24>K25,19,20))","v":" "}]
[14,{"$f":"IF(ISBLANK($B$55),\"BYE\",$B$55)","v":"BYE"},null,{"$f":"IF($C$12=$C$13,\" \",IF($C$12<$C$13,$B$12,$B$13))","v":" "},null,{"$f":"IF($E$28=$E$29,\" \",IF($E$28>$E$29,$D$28,$D$29))","v":" "},null,{"$f":"IF($G$28=$G$29,\" \",IF($G$28>$G$29,$F$28,$F$29))","v":" "},null,{"$f":"IF($I$24=$I$25,\" \",IF($I$24<$I$25,$H$24,$H$25))","v":" "},null,{"$f":"IF(K24=K25,\" \",IF(K24<K25,19,20))","v":" "}]
[11,{"$f":"IF(ISBLANK($B$52),\"BYE\",$B$52)","v":"BYE"},null,{"$f":"IF($C$14=$C$15,\" \",IF($C$14<$C$15,$B$14,$B$15))","v":" "},null,{"$f":"IF($E$30=$E$31,\" \",IF($E$30>$E$31,$D$30,$D$31))","v":" "},null,{"$f":"IF($G$22=$G$23,\" \",IF($G$22<$G$23,$F$22,$F$23))","v":" "},null,{"$f":"IF($I$26=$I$27,\" \",IF($I$26>$I$27,$H$26,$H$27))","v":" "},null,{"$f":"IF(K26=K27,\" \",IF(K26>K27,21,22))","v":" "}]
[22,{"$f":"IF(ISBLANK($B$63),\"BYE\",$B$63)","v":"BYE"},null,{"$f":"IF($C$16=$C$17,\" \",IF($C$16<$C$17,$B$16,$B$17))","v":" "},null,{"$f":"IF($E$32=$E$33,\" \",IF($E$32>$E$33,$D$32,$D$33))","v":" "},null,{"$f":"IF($G$24=$G$25,\" \",IF($G$24<$G$25,$F$24,$F$25))","v":" "},null,{"$f":"IF($I$28=$I$29,\" \",IF($I$28>$I$29,$H$28,$H$29))","v":" "},null,{"$f":"IF(K26=K27,\" \",IF(K26<K27,21,22))","v":" "}]
[27,{"$f":"IF(ISBLANK($B$68),\"BYE\",$B$68)","v":"BYE"},null,{"$f":"IF($C$18=$C$19,\" \",IF($C$18<$C$19,$B$18,$B$19))","v":" "},null,{"$f":"IF($E$34=$E$35,\" \",IF($E$34>$E$35,$D$34,$D$35))","v":" "},null,{"$f":"IF($G$26=$G$27,\" \",IF($G$26<$G$27,$F$26,$F$27))","v":" "},null,{"$f":"IF($I$26=$I$27,\" \",IF($I$26<$I$27,$H$26,$H$27))","v":" "},null,{"$f":"IF(K28=K29,\" \",IF(K28>K29,23,24))","v":" "}]
[6,{"$f":"IF(ISBLANK($B$47),\"BYE\",$B$47)","v":"BYE"},null,{"$f":"IF($C$20=$C$21,\" \",IF($C$20<$C$21,$B$20,$B$21))","v":" "},null,{"$f":"IF($E$36=$E$37,\" \",IF($E$36>$E$37,$D$36,$D$37))","v":" "},null,{"$f":"IF($G$28=$G$29,\" \",IF($G$28<$G$29,$F$28,$F$29))","v":" "},null,{"$f":"IF($I$28=$I$29,\" \",IF($I$28<$I$29,$H$28,$H$29))","v":" "},null,{"$f":"IF(K28=K29,\" \",IF(K28<K29,23,24))","v":" "}]
[7,{"$f":"IF(ISBLANK($B$48),\"BYE\",$B$48)","v":"BYE"},null,{"$f":"IF($C$22=$C$23,\" \",IF($C$22<$C$23,$B$22,$B$23))","v":" "},null,{"$f":"IF($E$22=$E$23,\" \",IF($E$22<$E$23,$D$22,$D$23))","v":" "},null,{"$f":"IF($G$30=$G$31,\" \",IF($G$30>$G$31,$F$30,$F$31))","v":" "},null,{"$f":"IF($I$30=$I$31,\" \",IF($I$30>$I$31,$H$30,$H$31))","v":" "},null,{"$f":"IF(K30=K31,\" \",IF(K30>K31,25,26))","v":" "}]
[26,{"$f":"IF(ISBLANK($B$67),\"BYE\",$B$67)","v":"BYE"},null,{"$f":"IF($C$24=$C$25,\" \",IF($C$24<$C$25,$B$24,$B25))","v":" "},null,{"$f":"IF($E$24=$E$25,\" \",IF($E$24<$E$25,$D$24,$D$25))","v":" "},null,{"$f":"IF($G$32=$G$33,\" \",IF($G$32>$G$33,$F$32,$F$33))","v":" "},null,{"$f":"IF($I$32=$I$33,\" \",IF($I$32>$I$33,$H$32,$H$33))","v":" "},null,{"$f":"IF(K30=K31,\" \",IF(K30<K31,25,26))","v":" "}]
[23,{"$f":"IF(ISBLANK($B$64),\"BYE\",$B$64)","v":"BYE"},null,{"$f":"IF($C$26=$C$27,\" \",IF($C$26<$C$27,$B$26,$B$27))","v":" "},null,{"$f":"IF($E$26=$E$27,\" \",IF($E$26<$E$27,$D$26,$D$27))","v":" "},null,{"$f":"IF($G$34=$G$35,\" \",IF($G$34>$G$35,$F$34,$F$35))","v":" "},null,{"$f":"IF($I$30=$I$31,\" \",IF($I$30<$I$31,$H$30,$H$31))","v":" "},null,{"$f":"IF(K32=K33,\" \",IF(K32>K33,27,28))","v":" "}]
[10,{"$f":"IF(ISBLANK($B$51),\"BYE\",$B$51)","v":"BYE"},null,{"$f":"IF($C$28=$C$29,\" \",IF($C$28<$C$29,$B$28,$B$29))","v":" "},null,{"$f":"IF($E$28=$E$29,\" \",IF($E$28<$E$29,$D$28,$D$29))","v":" "},null,{"$f":"IF($G$36=$G$37,\" \",IF($G$36>$G$37,$F$36,$F$37))","v":" "},null,{"$f":"IF($I$32=$I$33,\" \",IF($I$32<$I$33,$H$32,$H$33))","v":" "},null,{"$f":"IF(K32=K33,\" \",IF(K32<K33,29,30))","v":" "}]
[15,{"$f":"IF(ISBLANK($B$56),\"BYE\",$B$56)","v":"BYE"},null,{"$f":"IF($C$30=$C$31,\" \",IF($C$30<$C$31,$B$30,$B$31))","v":" "},null,{"$f":"IF($E$30=$E$31,\" \",IF($E$30<$E$31,$D$30,$D$31))","v":" "},null,{"$f":"IF($G$34=$G$35,\" \",IF($G$34<$G$35,$F$34,$F$35))","v":" "},null,{"$f":"IF($I$34=$I$35,\" \",IF($I$34>$I$35,$H$34,$H$35))","v":" "},null,{"$f":"IF(K34=K35,\" \",IF(K34>K35,29,30))","v":" "}]
[18,{"$f":"IF(ISBLANK($B$59),\"BYE\",$B$59)","v":"BYE"},null,{"$f":"IF($C$32=$C$33,\" \",IF($C$32<$C$33,$B$32,$B$33))","v":" "},null,{"$f":"IF($E$32=$E$33,\" \",IF($E$32<$E$33,$D$32,$D$33))","v":" "},null,{"$f":"IF($G$36=$G$37,\" \",IF($G$36<$G$37,$F$36,$F$37))","v":" "},null,{"$f":"IF($I$36=$I$37,\" \",IF($I$36>$I$37,$H$36,$H$37))","v":" "},null,{"$f":"IF(K34=K35,\" \",IF(K34<K35,29,30))","v":" "}]
[31,{"$f":"IF(ISBLANK($B$72),\"BYE\",$B$72)","v":"BYE"},null,{"$f":"IF($C$34=$C$35,\" \",IF($C$34<$C$35,$B$34,$B$35))","v":" "},null,{"$f":"IF($E$34=$E$35,\" \",IF($E$34<$E$35,$D$34,$D$35))","v":" "},null,{"$f":"IF($G$30=$G$31,\" \",IF($G$30<$G$31,$F$30,$F$31))","v":" "},null,{"$f":"IF($I$34=$I$35,\" \",IF($I$34<$I$35,$H$34,$H$35))","v":" "},null,{"$f":"IF(K36=K37,\" \",IF(K36>K37,31,32))","v":" "}]
[2,{"$f":"IF(ISBLANK($B$43),\"BYE\",$B$43)","v":"BYE"},null,{"$f":"IF($C$36=$C$37,\" \",IF($C$36<$C$37,$B$36,$B$37))","v":" "},null,{"$f":"IF($E$36=$E$37,\" \",IF($E$36<$E$37,$D$36,$D$37))","v":" "},null,{"$f":"IF($G$32=$G$33,\" \",IF($G$32<$G$33,$F$32,$F$33))","v":" "},null,{"$f":"IF($I$36=$I$37,\" \",IF($I$36<$I$37,$H$36,$H$37))","v":" "},null,{"$f":"IF(K36=K37,\" \",IF(K36<K37,31,32))","v":" "}]
[3]
[]
[]
[null,{"$f":"B1","v":0}]
[1]
[2]
[3]
[4]
[5]
[6]
[7]
[8]
[9]
[10]
[11]
[12]
[13]
[14]
[15]
[16]
[17]
[18]
[19]
[20]
[21]
[22]
[23]
[24]
[25]
[26]
[27]
[28]
[29]
[30]
[31]
[32]

{"sheet":"pavúk_64","index":14,"n_rows":69,"n_cols":17,"rows_kept":69,"hidden":true,"merged":[[1,1,1,13]]}
[]
[null,{"$f":"B1","v":0}]
[]
[]
[null,"1.kolo",null,"2.kolo",null,"3.kolo",null,"4.kolo",null,"5.kolo",null,"6.kolo",{"$nulls":4},"LOSOVANIE"]
[1,{"$f":"IF(ISBLANK($Q$6),\"BYE\",$Q$6)","v":"BYE"},null,{"$f":"IF($C$6=$C$7,\" \",IF($C$6>$C$7,$B$6,$B$7))","v":" "},null,{"$f":"IF($E$6=$E$7,\" \",IF($E$6>$E$7,$D$6,$D$7))","v":" "},null,{"$f":"IF($G$6=$G$7,\" \",IF($G$6>$G$7,$F$6,$F$7))","v":" "},null,{"$f":"IF($I$6=$I$7,\" \",IF($I$6>$I$7,$H$6,$H$7))","v":" "},null,{"$f":"IF($K$6=$K$7,\" \",IF($K$6>$K$7,$J$6,$J$7))","v":" "},null,{"$f":"IF(M6=M7,\" \",IF(M6>M7,1,2))","v":" "},null,1]
[64,{"$f":"IF(ISBLANK($Q$69),\"BYE\",$Q$69)","v":"BYE"},null,{"$f":"IF($C$8=$C$9,\" \",IF($C$8>$C$9,$B$8,$B$9))","v":" "},null,{"$f":"IF($E$8=$E$9,\" \",IF($E$8>$E$9,$D$8,$D$9))","v":" "},null,{"$f":"IF($G$8=$G$9,\" \",IF($G$8>$G$9,$F$8,$F$9))","v":" "},null,{"$f":"IF($I$8=$I$9,\" \",IF($I$8>$I$9,$H$8,$H$9))","v":" "},null,{"$f":"IF($K$8=$K$9,\" \",IF($K$8>$K$9,$J$8,$J$9))","v":" "},null,{"$f":"IF(M6=M7,\" \",IF(M6<M7,1,2))","v":" "},null,2]
[33,{"$f":"IF(ISBLANK($Q$38),\"BYE\",$Q$38)","v":"BYE"},null,{"$f":"IF($C$10=$C$11,\" \",IF($C$10>$C$11,$B$10,$B$11))","v":" "},null,{"$f":"IF($E$10=$E$11,\" \",IF($E$10>$E$11,$D$10,$D$11))","v":" "},null,{"$f":"IF($G$10=$G$11,\" \",IF($G$10>$G$11,$F$10,$F11))","v":" "},null,{"$f":"IF($I$10=$I$11,\" \",IF($I$10>$I$11,$H$10,$H$11))","v":" "},null,{"$f":"IF($K$6=$K$7,\" \",IF($K$6<$K$7,$J$6,$J$7))","v":" "},null,{"$f":"IF(M8=M9,\" \",IF(M8>M9,3,4))","v":" "},null,3]
[32,{"$f":"IF(ISBLANK($Q$37),\"BYE\",$Q$37)","v":"BYE"},null,{"$f":"IF($C$12=$C$13,\" \",IF($C$12>$C$13,$B$12,$B$13))","v":" "},null,{"$f":"IF($E$12=$E$13,\" \",IF($E$12>$E$13,$D$12,$D$13))","v":" "},null,{"$f":"IF($G$12=$G$13,\" \",IF($G$12>$G$13,$F$12,$F$13))","v":" "},null,{"$f":"IF($I$12=$I$13,\" \",IF($I$12>$I$13,$H$12,$H$13))","v":" "},null,{"$f":"IF($K$8=$K$9,\" \",IF($K$8<$K$9,$J$8,$J$9))","v":" "},null,{"$f":"IF(M8=M9,\" \",IF(M8<M9,3,4))","v":" "},null,4]
[17,{"$f":"IF(ISBLANK($Q$22),\"BYE\",$Q$22)","v":"BYE"},null,{"$f":"IF($C$14=$C$15,\" \",IF($C$14>$C$15,$B$14,$B$15))","v":" "},null,{"$f":"IF($E$14=$E$15,\" \",IF($E$14>$E$15,$D$14,$D$15))","v":" "},null,{"$f":"IF($G$14=$G$15,\" \",IF($G$14>$G$15,$F$14,$F$15))","v":" "},null,{"$f":"IF($I$6=$I$7,\" \",IF($I$6<$I$7,$H$6,$H$7))","v":" "},null,{"$f":"IF($K$10=$K$11,\" \",IF($K$10>$K$11,$J$10,$J$11))","v":" "},null,{"$f":"IF(M10=M11,\" \",IF(M10>M11,5,6))","v":" "},null,5]
[48,{"$f":"IF(ISBLANK($Q$53),\"BYE\",$Q$53)","v":"BYE"},null,{"$f":"IF($C$16=$C$17,\" \",IF($C$16>$C$17,$B$16,$B$17))","v":" "},null,{"$f":"IF($E$16=$E$17,\" \",IF($E$16>$E$17,$D$16,$D$17))","v":" "},null,{"$f":"IF($G$16=$G$17,\" \",IF($G$16>$G$17,$F$16,$F$17))","v":" "},null,{"$f":"IF($I$8=$I$9,\" \",IF($I$8<$I$9,$H$8,$H$9))","v":" "},null,{"$f":"IF($K$12=$K$13,\" \",IF($K$12>$K$13,$J$12,$J$13))","v":" "},null,{"$f":"IF(M10=M11,\" \",IF(M10<M11,5,6))","v":" "},null,6]
[49,{"$f":"IF(ISBLANK($Q$54),\"BYE\",$Q$54)","v":"BYE"},null,{"$f":"IF($C$18=$C$19,\" \",IF($C$18>$C$19,$B$18,$B$19))","v":" "},null,{"$f":"IF($E$18=$E$19,\" \",IF($E$18>$E$19,$D$18,$D$19))","v":" "},null,{"$f":"IF($G$18=$G$19,\" \",IF($G$18>$G$19,$F$18,$F$19))","v":" "},null,{"$f":"IF($I$10=$I$11,\" \",IF($I$10<$I$11,$H$10,$H$11))","v":" "},null,{"$f":"IF($K$10=$K$11,\" \",IF($K$10<$K$11,$J$10,$J$11))","v":" "},null,{"$f":"IF(M12=M13,\" \",IF(M12>M13,7,8))","v":" "},null,7]
[16,{"$f":"IF(ISBLANK($Q$21),\"BYE\",$Q$21)","v":"BYE"},null,{"$f":"IF($C$20=$C$21,\" \",IF($C$20>$C$21,$B$20,$B$21))","v":" "},null,{"$f":"IF($E$20=$E$21,\" \",IF($E$20>$E$21,$D$20,$D$21))","v":" "},null,{"$f":"IF($G$20=$G$21,\" \",IF($G$20>$G$21,$F$20,$F$21))","v":" "},null,{"$f":"IF($I$12=$I$13,\" \",IF($I$12<$I$13,$H$12,$H$13))","v":" "},null,{"$f":"IF($K$12=$K$13,\" \",IF($K$12<$K$13,$J$12,$J$13))","v":" "},null,{"$f":"IF(M12=M13,\" \",IF(M12<M13,7,8))","v":" "},null,8]
[9,{"$f":"IF(ISBLANK($Q$14),\"BYE\",$Q$14)","v":"BYE"},null,{"$f":"IF($C$22=$C$23,\" \",IF($C$22>$C$23,$B$22,$B$23))","v":" "},null,{"$f":"IF($E$22=$E$23,\" \",IF($E$22>$E$23,$D$22,$D$23))","v":" "},null,{"$f":"IF($G$6=$G$7,\" \",IF($G$6<$G$7,$F$6,$F$7))","v":" "},null,{"$f":"IF($I$14=$I$15,\" \",IF($I$14>$I$15,$H$14,$H$15))","v":" "},null,{"$f":"IF($K$14=$K$15,\" \",IF($K$14>$K$15,$J$14,$J$15))","v":" "},null,{"$f":"IF(M14=M15,\" \",IF(M14>M15,9,10))","v":" "},null,9]
[56,{"$f":"IF(ISBLANK($Q$61),\"BYE\",$Q$61)","v":"BYE"},null,{"$f":"IF($C$24=$C$25,\" \",IF($C$24>$C$25,$B$24,$B25))","v":" "},null,{"$f":"IF($E$24=$E$25,\" \",IF($E$24>$E$25,$D$24,$D$25))","v":" "},null,{"$f":"IF($G$8=$G$9,\" \",IF($G$8<$G$9,$F$8,$F$9))","v":" "},null,{"$f":"IF($I$16=$I$17,\" \",IF($I$16>$I$17,$H$16,$H$17))","v":" "},null,{"$f":"IF($K$16=$K$17,\" \",IF($K$16>$K$17,$J$16,$J$17))","v":" "},null,{"$f":"IF(M14=M15,\" \",IF(M14<M15,9,10))","v":" "},null,10]
[41,{"$f":"IF(ISBLANK($Q$46),\"BYE\",$Q$46)","v":"BYE"},null,{"$f":"IF($C$26=$C$27,\" \",IF($C$26>$C$27,$B$26,$B$27))","v":" "},null,{"$f":"IF($E$26=$E$27,\" \",IF($E$26>$E$27,$D$26,$D$27))","v":" "},null,{"$f":"IF($G$10=$G$11,\" \",IF($G$10<$G$11,$F$10,$F$11))","v":" "},null,{"$f":"IF($I$18=$I$19,\" \",IF($I$18>$I$19,$H$18,$H$19))","v":" "},null,{"$f":"IF($K$14=$K$15,\" \",IF($K$14<$K$15,$J$14,$J$15))","v":" "},null,{"$f":"IF(M16=M17,\" \",IF(M16>M17,11,12))","v":" "},null,11]
[24,{"$f":"IF(ISBLANK($Q$29),\"BYE\",$Q$29)","v":"BYE"},null,{"$f":"IF($C$28=$C$29,\" \",IF($C$28>$C$29,$B$28,$B$29))","v":" "},null,{"$f":"IF($E$28=$E$29,\" \",IF($E$28>$E$29,$D$28,$D$29))","v":" "},null,{"$f":"IF($G$12=$G$13,\" \",IF($G$12<$G$13,$F$12,$F$13))","v":" "},null,{"$f":"IF($I$20=$I$21,\" \",IF($I$20>$I$21,$H$20,$H$21))","v":" "},null,{"$f":"IF($K$16=$K$17,\" \",IF($K$16<$K$17,$J$16,$J$17))","v":" "},null,{"$f":"IF(M16=M17,\" \",IF(M16<M17,11,12))","v":" "},null,12]
[25,{"$f":"IF(ISBLANK($Q$30),\"BYE\",$Q$30)","v":"BYE"},null,{"$f":"IF($C$30=$C$31,\" \",IF($C$30>$C$31,$B$30,$B$31))","v":" "},null,{"$f":"IF($E$30=$E$31,\" \",IF($E$30>$E$31,$D$30,$D$31))","v":" "},null,{"$f":"IF($G$14=$G$15,\" \",IF($G$14<$G$15,$F$14,$F$15))","v":" "},null,{"$f":"IF($I$14=$I$15,\" \",IF($I$14<$I$15,$H$14,$H$15))","v":" "},null,{"$f":"IF($K$18=$K$19,\" \",IF($K$18>$K$19,$J$18,$J$19))","v":" "},null,{"$f":"IF(M18=M19,\" \",IF(M18>M19,13,14))","v":" "},null,13]
[40,{"$f":"IF(ISBLANK($Q$45),\"BYE\",$Q$45)","v":"BYE"},null,{"$f":"IF($C$32=$C$33,\" \",IF($C$32>$C$33,$B$32,$B$33))","v":" "},null,{"$f":"IF($E$32=$E$33,\" \",IF($E$32>$E$33,$D$32,$D$33))","v":" "},null,{"$f":"IF($G$16=$G$17,\" \",IF($G$16<$G$17,$F$16,$F$17))","v":" "},null,{"$f":"IF($I$16=$I$17,\" \",IF($I$16<$I$17,$H$16,$H$17))","v":" "},null,{"$f":"IF($K$20=$K$21,\" \",IF($K$20>$K$21,$J$20,$J$21))","v":" "},null,{"$f":"IF(M18=M19,\" \",IF(M18<M19,13,14))","v":" "},null,14]
[57,{"$f":"IF(ISBLANK($Q$62),\"BYE\",$Q$62)","v":"BYE"},null,{"$f":"IF($C$34=$C$35,\" \",IF($C$34>$C$35,$B$34,$B$35))","v":" "},null,{"$f":"IF($E$34=$E$35,\" \",IF($E$34>$E$35,$D$34,$D$35))","v":" "},null,{"$f":"IF($G$18=$G$19,\" \",IF($G$18<$G$19,$F$18,$F$19))","v":" "},null,{"$f":"IF($I$18=$I$19,\" \",IF($I$18<$I$19,$H$18,$H$19))","v":" "},null,{"$f":"IF($K$18=$K$19,\" \",IF($K$18<$K$19,$J$18,$J$19))","v":" "},null,{"$f":"IF(M20=M21,\" \",IF(M20>M21,15,16))","v":" "},null,15]
[8,{"$f":"IF(ISBLANK($Q$13),\"BYE\",$Q$13)","v":"BYE"},null,{"$f":"IF($C$36=$C$37,\" \",IF($C$36>$C$37,$B$36,$B$37))","v":" "},null,{"$f":"IF($E$36=$E$37,\" \",IF($E$36>$E$37,$D$36,$D$37))","v":" "},null,{"$f":"IF($G$20=$G$21,\" \",IF($G$20<$G$21,$F$20,$F$21))","v":" "},null,{"$f":"IF($I$20=$I$21,\" \",IF($I$20<$I$21,$H$20,$H$21))","v":" "},null,{"$f":"IF($K$20=$K$21,\" \",IF($K$20<$K$21,$J$20,$J$21))","v":" "},null,{"$f":"IF(M20=M21,\" \",IF(M20<M21,15,16))","v":" "},null,16]
[5,{"$f":"IF(ISBLANK($Q$10),\"BYE\",$Q$10)","v":"BYE"},null,{"$f":"IF($C$38=$C$39,\" \",IF($C$38<$C$39,$B$39,$B$38))","v":" "},null,{"$f":"IF($E$6=$E$7,\" \",IF($E$6<$E$7,$D$6,$D$7))","v":" "},null,{"$f":"IF($G$22=$G$23,\" \",IF($G$22>$G$23,$F$22,$F$23))","v":" "},null,{"$f":"IF($I$22=$I$23,\" \",IF($I$22>$I$23,$H$22,$H$23))","v":" "},null,{"$f":"IF($K$22=$K$23,\" \",IF($K$22>$K$23,$J$22,$J$23))","v":" "},null,{"$f":"IF(M22=M23,\" \",IF(M22>M23,17,18))","v":" "},null,17]
[60,{"$f":"IF(ISBLANK($Q$65),\"BYE\",$Q$65)","v":"BYE"},null,{"$f":"IF($C$40=$C$41,\" \",IF($C$40<$C$41,$B$41,$B$40))","v":" "},null,{"$f":"IF($E$8=$E$9,\" \",IF($E$8<$E$9,$D$8,$D$9))","v":" "},null,{"$f":"IF($G$24=$G$25,\" \",IF($G$24>$G$25,$F$24,$F$25))","v":" "},null,{"$f":"IF($I$24=$I$25,\" \",IF($I$24>$I$25,$H$24,$H$25))","v":" "},null,{"$f":"IF($K$24=$K$25,\" \",IF($K$24>$K$25,$J$24,$J$25))","v":" "},null,{"$f":"IF(M22=M23,\" \",IF(M22<M23,17,18))","v":" "},null,18]
[37,{"$f":"IF(ISBLANK($Q$42),\"BYE\",$Q$42)","v":"BYE"},null,{"$f":"IF($C$42=$C$43,\" \",IF($C$42<$C$43,$B$43,$B$42))","v":" "},null,{"$f":"IF($E$10=$E$11,\" \",IF($E$10<$E$11,$D$10,$D$11))","v":" "},null,{"$f":"IF($G$26=$G$27,\" \",IF($G$26>$G$27,$F$26,$F$27))","v":" "},null,{"$f":"IF($I$26=$I$27,\" \",IF($I$26>$I$27,$H$26,$H$27))","v":" "},null,{"$f":"IF($K$22=$K$23,\" \",IF($K$22<$K$23,$J$22,$J$23))","v":" "},null,{"$f":"IF(M24=M25,\" \",IF(M24>M25,19,20))","v":" "},null,19]
[28,{"$f":"IF(ISBLANK($Q$33),\"BYE\",$Q$33)","v":"BYE"},null,{"$f":"IF($C$44=$C$45,\" \",IF($C$44<$C$45,$B$45,$B$44))","v":" "},null,{"$f":"IF($E$12=$E$13,\" \",IF($E$12<$E$13,$D$12,$D$13))","v":" "},null,{"$f":"IF($G$28=$G$29,\" \",IF($G$28>$G$29,$F$28,$F$29))","v":" "},null,{"$f":"IF($I$28=$I$29,\" \",IF($I$28>$I$29,$H$28,$H$29))","v":" "},null,{"$f":"IF($K$24=$K$25,\" \",IF($K$24<$K$25,$J$24,$J$25))","v":" "},null,{"$f":"IF(M24=M25,\" \",IF(M24<M25,19,20))","v":" "},null,20]
[21,{"$f":"IF(ISBLANK($Q$26),\"BYE\",$Q$26)","v":"BYE"},null,{"$f":"IF($C$46=$C$47,\" \",IF($C$46<$C$47,$B$47,$B$46))","v":" "},null,{"$f":"IF($E$14=$E$15,\" \",IF($E$14<$E$15,$D$14,$D$15))","v":" "},null,{"$f":"IF($G$30=$G$31,\" \",IF($G$30>$G$31,$F$30,$F$31))","v":" "},null,{"$f":"IF($I$22=$I$23,\" \",IF($I$22<$I$23,$H$22,$H$23))","v":" "},null,{"$f":"IF($K$26=$K$27,\" \",IF($K$26>$K$27,$J$26,$J$27))","v":" "},null,{"$f":"IF(M26=M27,\" \",IF(M26>M27,21,22))","v":" "},null,21]
[44,{"$f":"IF(ISBLANK($Q$49),\"BYE\",$Q$49)","v":"BYE"},null,{"$f":"IF($C$48=$C$49,\" \",IF($C$48<$C$49,$B$49,$B$48))","v":" "},null,{"$f":"IF($E$16=$E$17,\" \",IF($E$16<$E$17,$D$16,$D$17))","v":" "},null,{"$f":"IF($G$32=$G$33,\" \",IF($G$32>$G$33,$F$32,$F$33))","v":" "},null,{"$f":"IF($I$24=$I$25,\" \",IF($I$24<$I$25,$H$24,$H$25))","v":" "},null,{"$f":"IF($K$28=$K$29,\" \",IF($K$28>$K$29,$J$28,$J$29))","v":" "},null,{"$f":"IF(M26=M27,\" \",IF(M26<M27,21,22))","v":" "},null,22]
[53,{"$f":"IF(ISBLANK($Q$58),\"BYE\",$Q$58)","v":"BYE"},null,{"$f":"IF($C$50=$C$51,\" \",IF($C$50<$C$51,$B$51,$B$50))","v":" "},null,{"$f":"IF($E$18=$E$19,\" \",IF($E$18<$E$19,$D$18,$D$19))","v":" "},null,{"$f":"IF($G$34=$G$35,\" \",IF($G$34>$G$35,$F$34,$F$35))","v":" "},null,{"$f":"IF($I$26=$I$27,\" \",IF($I$26<$I$27,$H$26,$H$27))","v":" "},null,{"$f":"IF($K$26=$K$27,\" \",IF($K$26<$K$27,$J$26,$J$27))","v":" "},null,{"$f":"IF(M28=M29,\" \",IF(M28>M29,23,24))","v":" "},null,23]
[12,{"$f":"IF(ISBLANK($Q$17),\"BYE\",$Q$17)","v":"BYE"},null,{"$f":"IF($C$52=$C$53,\" \",IF($C$52<$C$53,$B$53,$B$52))","v":" "},null,{"$f":"IF($E$20=$E$21,\" \",IF($E$20<$E$21,$D$20,$D$21))","v":" "},null,{"$f":"IF($G$36=$G$37,\" \",IF($G$36>$G$37,$F$36,$F$37))","v":" "},null,{"$f":"IF($I$28=$I$29,\" \",IF($I$28<$I$29,$H$28,$H$29))","v":" "},null,{"$f":"IF($K$28=$K$29,\" \",IF($K$28<$K$29,$J$28,$J$29))","v":" "},null,{"$f":"IF(M28=M29,\" \",IF(M28<M29,23,24))","v":" "},null,24]
[13,{"$f":"IF(ISBLANK($Q$18),\"BYE\",$Q$18)","v":"BYE"},null,{"$f":"IF($C$54=$C$55,\" \",IF($C$54<$C$55,$B$55,$B$54))","v":" "},null,{"$f":"IF($E$22=$E$23,\" \",IF($E$22<$E$23,$D$22,$D$23))","v":" "},null,{"$f":"IF($G$22=$G$23,\" \",IF($G$22<$G$23,$F$22,$F$23))","v":" "},null,{"$f":"IF($I$30=$I$31,\" \",IF($I$30>$I$31,$H$30,$H$31))","v":" "},null,{"$f":"IF($K$30=$K$31,\" \",IF($K$30>$K$31,$J$30,$J$31))","v":" "},null,{"$f":"IF(M30=M31,\" \",IF(M30>M31,25,26))","v":" "},null,25]
[52,{"$f":"IF(ISBLANK($Q$57),\"BYE\",$Q$57)","v":"BYE"},null,{"$f":"IF($C$56=$C$57,\" \",IF($C$56<$C$57,$B$57,$B$56))","v":" "},null,{"$f":"IF($E$24=$E$25,\" \",IF($E$24<$E$25,$D$24,$D$25))","v":" "},null,{"$f":"IF($G$24=$G$25,\" \",IF($G$24<$G$25,$F$24,$F$25))","v":" "},null,{"$f":"IF($I$32=$I$33,\" \",IF($I$32>$I$33,$H$32,$H$33))","v":" "},null,{"$f":"IF($K$32=$K$33,\" \",IF($K$32>$K$33,$J$32,$J$33))","v":" "},null,{"$f":"IF(M30=M31,\" \",IF(M30<M31,25,26))","v":" "},null,26]
[45,{"$f":"IF(ISBLANK($Q$50),\"BYE\",$Q$50)","v":"BYE"},null,{"$f":"IF($C$58=$C$59,\" \",IF($C$58<$C$59,$B$59,$B$58))","v":" "},null,{"$f":"IF($E$26=$E$27,\" \",IF($E$26<$E$27,$D$26,$D$27))","v":" "},null,{"$f":"IF($G$26=$G$27,\" \",IF($G$26<$G$27,$F$26,$F$27))","v":" "},null,{"$f":"IF($I$34=$I$35,\" \",IF($I$34>$I$35,$H$34,$H$35))","v":" "},null,{"$f":"IF($K$30=$K$31,\" \",IF($K$30<$K$31,$J$30,$J$31))","v":" "},null,{"$f":"IF(M32=M33,\" \",IF(M32>M33,27,28))","v":" "},null,27]
[20,{"$f":"IF(ISBLANK($Q$25),\"BYE\",$Q$25)","v":"BYE"},null,{"$f":"IF($C$60=$C$61,\" \",IF($C$60<$C$61,$B$61,$B$60))","v":" "},null,{"$f":"IF($E$28=$E$29,\" \",IF($E$28<$E$29,$D$28,$D$29))","v":" "},null,{"$f":"IF($G$28=$G$29,\" \",IF($G$28<$G$29,$F$28,$F$29))","v":" "},null,{"$f":"IF($I$36=$I$37,\" \",IF($I$36>$I$37,$H$36,$H$37))","v":" "},null,{"$f":"IF($K$32=$K$33,\" \",IF($K$32<$K$33,$J$32,$J$33))","v":" "},null,{"$f":"IF(M32=M33,\" \",IF(M32<M33,27,28))","v":" "},null,28]
[29,{"$f":"IF(ISBLANK($Q$34),\"BYE\",$Q$34)","v":"BYE"},null,{"$f":"IF($C$62=$C$63,\" \",IF($C$62<$C$63,$B$63,$B$62))","v":" "},null,{"$f":"IF($E$30=$E$31,\" \",IF($E$30<$E$31,$D$30,$D$31))","v":" "},null,{"$f":"IF($G$30=$G$31,\" \",IF($G$30<$G$31,$F$30,$F$31))","v":" "},null,{"$f":"IF($I$30=$I$31,\" \",IF($I$30<$I$31,$H$30,$H$31))","v":" "},null,{"$f":"IF($K$34=$K$35,\" \",IF($K$34>$K$35,$J$34,$J$35))","v":" "},null,{"$f":"IF(M34=M35,\" \",IF(M34>M35,29,30))","v":" "},null,29]
[36,{"$f":"IF(ISBLANK($Q$41),\"BYE\",$Q$41)","v":"BYE"},null,{"$f":"IF($C$64=$C$65,\" \",IF($C$64<$C$65,$B$65,$B$64))","v":" "},null,{"$f":"IF($E$32=$E$33,\" \",IF($E$32<$E$33,$D$32,$D$33))","v":" "},null,{"$f":"IF($G$32=$G$33,\" \",IF($G$32<$G$33,$F$32,$F$33))","v":" "},null,{"$f":"IF($I$32=$I$33,\" \",IF($I$32<$I$33,$H$32,$H$33))","v":" "},null,{"$f":"IF($K$36=$K$37,\" \",IF($K$36>$K$37,$J$36,$J$37))","v":" "},null,{"$f":"IF(M34=M35,\" \",IF(M34<M35,29,30))","v":" "},null,30]
[61,{"$f":"IF(ISBLANK($Q$66),\"BYE\",$Q$66)","v":"BYE"},null,{"$f":"IF($C$66=$C$67,\" \",IF($C$66<$C$67,$B$67,$B$66))","v":" "},null,{"$f":"IF($E$34=$E$35,\" \",IF($E$34<$E$35,$D$34,$D$35))","v":" "},null,{"$f":"IF($G$34=$G$35,\" \",IF($G$34<$G$35,$F$34,$F$35))","v":" "},null,{"$f":"IF($I$34=$I$35,\" \",IF($I$34<$I$35,$H$34,$H$35))","v":" "},null,{"$f":"IF($K$34=$K$35,\" \",IF($K$34<$K$35,$J$34,$J$35))","v":" "},null,{"$f":"IF(M36=M37,\" \",IF(M36>M37,31,32))","v":" "},null,31]
[4,{"$f":"IF(ISBLANK($Q$9),\"BYE\",$Q$9)","v":"BYE"},null,{"$f":"IF($C$68=$C$69,\" \",IF($C$68<$C$69,$B$69,$B$68))","v":" "},null,{"$f":"IF($E$36=$E$37,\" \",IF($E$36<$E$37,$D$36,$D$37))","v":" "},null,{"$f":"IF($G$36=$G$37,\" \",IF($G$36<$G$37,$F$36,$F$37))","v":" "},null,{"$f":"IF($I$36=$I$37,\" \",IF($I$36<$I$37,$H$36,$H$37))","v":" "},null,{"$f":"IF($K$36=$K$37,\" \",IF($K$36<$K$37,$J$36,$J$37))","v":" "},null,{"$f":"IF(M36=M37,\" \",IF(M36<M37,31,32))","v":" "},null,32]
[3,{"$f":"IF(ISBLANK($Q$8),\"BYE\",$Q$8)","v":"BYE"},null,{"$f":"IF($C$6=$C$7,\" \",IF($C$6<$C$7,$B$6,$B$7))","v":" "},null,{"$f":"IF($E$38=$E$39,\" \",IF($E$38>$E$39,$D$38,$D$39))","v":" "},null,{"$f":"IF($G$38=$G$39,\" \",IF($G$38>$G$39,$F$38,$F$39))","v":" "},null,{"$f":"IF($I$38=$I$39,\" \",IF($I$38>$I$39,$H$38,$H$39))","v":" "},null,{"$f":"IF($K$38=$K$39,\" \",IF($K$38>$K$39,$J$38,$J$39))","v":" "},null,{"$f":"IF(M38=M39,\" \",IF(M38>M39,33,34))","v":" "},null,33]
[62,{"$f":"IF(ISBLANK($Q$67),\"BYE\",$Q$67)","v":"BYE"},null,{"$f":"IF($C$8=$C$9,\" \",IF($C$8<$C$9,$B$8,$B$9))","v":" "},null,{"$f":"IF($E$40=$E$41,\" \",IF($E$40>$E$41,$D$40,$D$41))","v":" "},null,{"$f":"IF($G$40=$G$41,\" \",IF($G$40>$G$41,$F$40,$F$41))","v":" "},null,{"$f":"IF($I$40=$I$41,\" \",IF($I$40>$I$41,$H$40,$H$41))","v":" "},null,{"$f":"IF($K$40=$K$41,\" \",IF($K$40>$K$41,$J$40,$J$41))","v":" "},null,{"$f":"IF(M38=M39,\" \",IF(M38<M39,33,34))","v":" "},null,34]
[35,{"$f":"IF(ISBLANK($Q$40),\"BYE\",$Q$40)","v":"BYE"},null,{"$f":"IF($C$10=$C$11,\" \",IF($C$10<$C$11,$B$10,$B$11))","v":" "},null,{"$f":"IF($E$42=$E$43,\" \",IF($E$42>$E$43,$D$42,$D$43))","v":" "},null,{"$f":"IF($G$42=$G$43,\" \",IF($G$42>$G$43,$F$42,$F$43))","v":" "},null,{"$f":"IF($I$42=$I$43,\" \",IF($I$42>$I$43,$H$42,$H$43))","v":" "},null,{"$f":"IF($K$38=$K$39,\" \",IF($K$38<$K$39,$J$38,$J$39))","v":" "},null,{"$f":"IF(M40=M41,\" \",IF(M40>M41,35,36))","v":" "},null,35]
[30,{"$f":"IF(ISBLANK($Q$35),\"BYE\",$Q$35)","v":"BYE"},null,{"$f":"IF($C$12=$C$13,\" \",IF($C$12<$C$13,$B$12,$B$13))","v":" "},null,{"$f":"IF($E$44=$E$45,\" \",IF($E$44>$E$45,$D$44,$D$45))","v":" "},null,{"$f":"IF($G$44=$G$45,\" \",IF($G$44>$G$45,$F$44,$F$45))","v":" "},null,{"$f":"IF($I$44=$I$45,\" \",IF($I$44>$I$45,$H$44,$H$45))","v":" "},null,{"$f":"IF($K$40=$K$41,\" \",IF($K$40<$K$41,$J$40,$J$41))","v":" "},null,{"$f":"IF(M40=M41,\" \",IF(M40<M41,35,36))","v":" "},null,36]
[19,{"$f":"IF(ISBLANK($Q$24),\"BYE\",$Q$24)","v":"BYE"},null,{"$f":"IF($C$14=$C$15,\" \",IF($C$14<$C$15,$B$14,$B$15))","v":" "},null,{"$f":"IF($E$46=$E$47,\" \",IF($E$46>$E$47,$D$46,$D$47))","v":" "},null,{"$f":"IF($G$46=$G$47,\" \",IF($G$46>$G$47,$F$46,$F$47))","v":" "},null,{"$f":"IF($I$38=$I$39,\" \",IF($I$38<$I$39,$H$38,$H$39))","v":" "},null,{"$f":"IF($K$42=$K$43,\" \",IF($K$42>$K$43,$J$42,$J$43))","v":" "},null,{"$f":"IF(M42=M43,\" \",IF(M42>M43,37,38))","v":" "},null,37]
[46,{"$f":"IF(ISBLANK($Q$51),\"BYE\",$Q$51)","v":"BYE"},null,{"$f":"IF($C$16=$C$17,\" \",IF($C$16<$C$17,$B$16,$B$17))","v":" "},null,{"$f":"IF($E$48=$E$49,\" \",IF($E$48>$E$49,$D$48,$D$49))","v":" "},null,{"$f":"IF($G$48=$G$49,\" \",IF($G$48>$G$49,$F$48,$F$49))","v":" "},null,{"$f":"IF($I$40=$I$41,\" \",IF($I$40<$I$41,$H$40,$H$41))","v":" "},null,{"$f":"IF($K$44=$K$45,\" \",IF($K$44>$K$45,$J$44,$J$45))","v":" "},null,{"$f":"IF(M42=M43,\" \",IF(M42<M43,37,38))","v":" "},null,38]
[51,{"$f":"IF(ISBLANK($Q$56),\"BYE\",$Q$56)","v":"BYE"},null,{"$f":"IF($C$18=$C$19,\" \",IF($C$18<$C$19,$B$18,$B$19))","v":" "},null,{"$f":"IF($E$50=$E$51,\" \",IF($E$50>$E$51,$D$50,$D$51))","v":" "},null,{"$f":"IF($G$50=$G$51,\" \",IF($G$50>$G$51,$F$50,$F$51))","v":" "},null,{"$f":"IF($I$42=$I$43,\" \",IF($I$42<$I$43,$H$42,$H$43))","v":" "},null,{"$f":"IF($K$42=$K$43,\" \",IF($K$42<$K$43,$J$42,$J$43))","v":" "},null,{"$f":"IF(M44=M45,\" \",IF(M44>M45,39,40))","v":" "},null,39]
[14,{"$f":"IF(ISBLANK($Q$19),\"BYE\",$Q$19)","v":"BYE"},null,{"$f":"IF($C$20=$C$21,\" \",IF($C$20<$C$21,$B$20,$B$21))","v":" "},null,{"$f":"IF($E$52=$E$53,\" \",IF($E$52>$E$53,$D$52,$D$53))","v":" "},null,{"$f":"IF($G$52=$G$53,\" \",IF($G$52>$G$53,$F$52,$F$53))","v":" "},null,{"$f":"IF($I$44=$I$45,\" \",IF($I$44<$I$45,$H$44,$H$45))","v":" "},null,{"$f":"IF($K$44=$K$45,\" \",IF($K$44<$K$45,$J$44,$J$45))","v":" "},null,{"$f":"IF(M44=M45,\" \",IF(M44<M45,39,40))","v":" "},null,40]
[11,{"$f":"IF(ISBLANK($Q$16),\"BYE\",$Q$16)","v":"BYE"},null,{"$f":"IF($C$22=$C$23,\" \",IF($C$22<$C$23,$B$22,$B$23))","v":" "},null,{"$f":"IF($E$54=$E$55,\" \",IF($E$54>$E$55,$D$54,$D$55))","v":" "},null,{"$f":"IF($G$38=$G$39,\" \",IF($G$38<$G$39,$F$38,$F$39))","v":" "},null,{"$f":"IF($I$46=$I$47,\" \",IF($I$46>$I$47,$H$46,$H$47))","v":" "},null,{"$f":"IF($K$46=$K$47,\" \",IF($K$46>$K$47,$J$46,$J$47))","v":" "},null,{"$f":"IF(M46=M47,\" \",IF(M46>M47,41,42))","v":" "},null,41]
[54,{"$f":"IF(ISBLANK($Q$59),\"BYE\",$Q$59)","v":"BYE"},null,{"$f":"IF($C$24=$C$25,\" \",IF($C$24<$C$25,$B$24,$B25))","v":" "},null,{"$f":"IF($E$56=$E$57,\" \",IF($E$56>$E$57,$D$56,$D$57))","v":" "},null,{"$f":"IF($G$40=$G$41,\" \",IF($G$40<$G$41,$F$40,$F$41))","v":" "},null,{"$f":"IF($I$48=$I$49,\" \",IF($I$48>$I$49,$H$48,$H$49))","v":" "},null,{"$f":"IF($K$48=$K$49,\" \",IF($K$48>$K$49,$J$48,$J$49))","v":" "},null,{"$f":"IF(M46=M47,\" \",IF(M46<M47,41,42))","v":" "},null,42]
[43,{"$f":"IF(ISBLANK($Q$48),\"BYE\",$Q$48)","v":"BYE"},null,{"$f":"IF($C$26=$C$27,\" \",IF($C$26<$C$27,$B$26,$B$27))","v":" "},null,{"$f":"IF($E$58=$E$59,\" \",IF($E$58>$E$59,$D$58,$D$59))","v":" "},null,{"$f":"IF($G$42=$G$43,\" \",IF($G$42<$G$43,$F$42,$F$43))","v":" "},null,{"$f":"IF($I$50=$I$51,\" \",IF($I$50>$I$51,$H$50,$H$51))","v":" "},null,{"$f":"IF($K$46=$K$47,\" \",IF($K$46<$K$47,$J$46,$J$47))","v":" "},null,{"$f":"IF(M48=M49,\" \",IF(M48>M49,43,44))","v":" "},null,43]
[22,{"$f":"IF(ISBLANK($Q$27),\"BYE\",$Q$27)","v":"BYE"},null,{"$f":"IF($C$28=$C$29,\" \",IF($C$28<$C$29,$B$28,$B$29))","v":" "},null,{"$f":"IF($E$60=$E$61,\" \",IF($E$60>$E$61,$D$60,$D$61))","v":" "},null,{"$f":"IF($G$44=$G$45,\" \",IF($G$44<$G$45,$F$44,$F$45))","v":" "},null,{"$f":"IF($I$52=$I$53,\" \",IF($I$52>$I$53,$H$52,$H$53))","v":" "},null,{"$f":"IF($K$48=$K$49,\" \",IF($K$48<$K$49,$J$48,$J$49))","v":" "},null,{"$f":"IF(M48=M49,\" \",IF(M48<M49,43,44))","v":" "},null,44]
[27,{"$f":"IF(ISBLANK($Q$32),\"BYE\",$Q$32)","v":"BYE"},null,{"$f":"IF($C$30=$C$31,\" \",IF($C$30<$C$31,$B$30,$B$31))","v":" "},null,{"$f":"IF($E$62=$E$63,\" \",IF($E$62>$E$63,$D$62,$D$63))","v":" "},null,{"$f":"IF($G$46=$G$47,\" \",IF($G$46<$G$47,$F$46,$F$47))","v":" "},null,{"$f":"IF($I$46=$I$47,\" \",IF($I$46<$I$47,$H$46,$H$47))","v":" "},null,{"$f":"IF($K$50=$K$51,\" \",IF($K$50>$K$51,$J$50,$J$51))","v":" "},null,{"$f":"IF(M50=M51,\" \",IF(M50>M51,45,46))","v":" "},null,45]
[38,{"$f":"IF(ISBLANK($Q$43),\"BYE\",$Q$43)","v":"BYE"},null,{"$f":"IF($C$32=$C$33,\" \",IF($C$32<$C$33,$B$32,$B$33))","v":" "},null,{"$f":"IF($E$64=$E$65,\" \",IF($E$64>$E$65,$D$64,$D$65))","v":" "},null,{"$f":"IF($G$48=$G$49,\" \",IF($G$48<$G$49,$F$48,$F$49))","v":" "},null,{"$f":"IF($I$48=$I$49,\" \",IF($I$48<$I$49,$H$48,$H$49))","v":" "},null,{"$f":"IF($K$52=$K$53,\" \",IF($K$52>$K$53,$J$52,$J$53))","v":" "},null,{"$f":"IF(M50=M51,\" \",IF(M50<M51,45,46))","v":" "},null,46]
[59,{"$f":"IF(ISBLANK($Q$64),\"BYE\",$Q$64)","v":"BYE"},null,{"$f":"IF($C$34=$C$35,\" \",IF($C$34<$C$35,$B$34,$B$35))","v":" "},null,{"$f":"IF($E$66=$E$67,\" \",IF($E$66>$E$67,$D$66,$D$67))","v":" "},null,{"$f":"IF($G$50=$G$51,\" \",IF($G$50<$G$51,$F$50,$F$51))","v":" "},null,{"$f":"IF($I$50=$I$51,\" \",IF($I$50<$I$51,$H$50,$H$51))","v":" "},null,{"$f":"IF($K$50=$K$51,\" \",IF($K$50<$K$51,$J$50,$J$51))","v":" "},null,{"$f":"IF(M52=M53,\" \",IF(M52>M53,47,48))","v":" "},null,47]
[6,{"$f":"IF(ISBLANK($Q$11),\"BYE\",$Q$11)","v":"BYE"},null,{"$f":"IF($C$36=$C$37,\" \",IF($C$36<$C$37,$B$36,$B$37))","v":" "},null,{"$f":"IF($E$68=$E$69,\" \",IF($E$68>$E$69,$D$68,$D$69))","v":" "},null,{"$f":"IF($G$52=$G$53,\" \",IF($G$52<$G$53,$F$52,$F$53))","v":" "},null,{"$f":"IF($I$52=$I$53,\" \",IF($I$52<$I$53,$H$52,$H$53))","v":" "},null,{"$f":"IF($K$52=$K$53,\" \",IF($K$52<$K$53,$J$52,$J$53))","v":" "},null,{"$f":"IF(M52=M53,\" \",IF(M52<M53,47,48))","v":" "},null,48]
[7,{"$f":"IF(ISBLANK($Q$12),\"BYE\",$Q$12)","v":"BYE"},null,{"$f":"IF($C$38=$C$39,\" \",IF($C$38<$C$39,$B$38,$B$39))","v":" "},null,{"$f":"IF($E$38=$E$39,\" \",IF($E$38>$E$39,$D$39,$D$38))","v":" "},null,{"$f":"IF($G$54=$G$55,\" \",IF($G$54>$G$55,$F$54,$F$55))","v":" "},null,{"$f":"IF($I$54=$I$55,\" \",IF($I$54>$I$55,$H$54,$H$55))","v":" "},null,{"$f":"IF($K$54=$K$55,\" \",IF($K$54>$K$55,$J$54,$J$55))","v":" "},null,{"$f":"IF(M54=M55,\" \",IF(M54>M55,49,50))","v":" "},null,49]
[58,{"$f":"IF(ISBLANK($Q$63),\"BYE\",$Q$63)","v":"BYE"},null,{"$f":"IF($C$40=$C$41,\" \",IF($C$40<$C$41,$B$40,$B$41))","v":" "},null,{"$f":"IF($E$40=$E$41,\" \",IF($E$41>$E$40,$D$40,$D$41))","v":" "},null,{"$f":"IF($G$56=$G$57,\" \",IF($G$56>$G$57,$F$56,$F$57))","v":" "},null,{"$f":"IF($I$56=$I$57,\" \",IF($I$56>$I$57,$H$56,$H$57))","v":" "},null,{"$f":"IF($K$56=$K$57,\" \",IF($K$56>$K$57,$J$56,$J$57))","v":" "},null,{"$f":"IF(M54=M55,\" \",IF(M54<M55,49,50))","v":" "},null,50]
[39,{"$f":"IF(ISBLANK($Q$44),\"BYE\",$Q$44)","v":"BYE"},null,{"$f":"IF($C$42=$C$43,\" \",IF($C$42<$C$43,$B$42,$B$43))","v":" "},null,{"$f":"IF($E$42=$E$43,\" \",IF($E$43>$E$42,$D$42,$D$43))","v":" "},null,{"$f":"IF($G$58=$G$59,\" \",IF($G$58>$G$59,$F$58,$F$59))","v":" "},null,{"$f":"IF($I$58=$I$59,\" \",IF($I$58>$I$59,$H$58,$H$59))","v":" "},null,{"$f":"IF($K$54=$K$55,\" \",IF($K$54<$K$55,$J$54,$J$55))","v":" "},null,{"$f":"IF(M56=M57,\" \",IF(M56>M57,51,52))","v":" "},null,51]
[26,{"$f":"IF(ISBLANK($Q$31),\"BYE\",$Q$31)","v":"BYE"},null,{"$f":"IF($C$44=$C$45,\" \",IF($C$44<$C$45,$B$44,$B$45))","v":" "},null,{"$f":"IF($E$44=$E$45,\" \",IF($E$45>$E$44,$D$44,$D$45))","v":" "},null,{"$f":"IF($G$60=$G$61,\" \",IF($G$60>$G$61,$F$60,$F$61))","v":" "},null,{"$f":"IF($I$60=$I$61,\" \",IF($I$60>$I$61,$H$60,$H$61))","v":" "},null,{"$f":"IF($K$56=$K$57,\" \",IF($K$56<$K$57,$J$56,$J$57))","v":" "},null,{"$f":"IF(M56=M57,\" \",IF(M56<M57,51,52))","v":" "},null,52]
[23,{"$f":"IF(ISBLANK($Q$28),\"BYE\",$Q$28)","v":"BYE"},null,{"$f":"IF($C$46=$C$47,\" \",IF($C$46<$C$47,$B$46,$B$47))","v":" "},null,{"$f":"IF($E$46=$E$47,\" \",IF($E$47>$E$46,$D$46,$D$47))","v":" "},null,{"$f":"IF($G$62=$G$63,\" \",IF($G$62>$G$63,$F$62,$F$63))","v":" "},null,{"$f":"IF($I$54=$I$55,\" \",IF($I$54<$I$55,$H$54,$H$55))","v":" "},null,{"$f":"IF($K$58=$K$59,\" \",IF($K$58>$K$59,$J$58,$J$59))","v":" "},null,{"$f":"IF(M58=M59,\" \",IF(M58>M59,53,54))","v":" "},null,53]
[42,{"$f":"IF(ISBLANK($Q$47),\"BYE\",$Q$47)","v":"BYE"},null,{"$f":"IF($C$48=$C$49,\" \",IF($C$48<$C$49,$B$48,$B$49))","v":" "},null,{"$f":"IF($E$48=$E$49,\" \",IF($E$49>$E$48,$D$48,$D$49))","v":" "},null,{"$f":"IF($G$64=$G$65,\" \",IF($G$64>$G$65,$F$64,$F$65))","v":" "},null,{"$f":"IF($I$56=$I$57,\" \",IF($I$56<$I$57,$H$56,$H$57))","v":" "},null,{"$f":"IF($K$60=$K$61,\" \",IF($K$60>$K$61,$J$60,$J$61))","v":" "},null,{"$f":"IF(M58=M59,\" \",IF(M58<M59,53,54))","v":" "},null,54]
[55,{"$f":"IF(ISBLANK($Q$60),\"BYE\",$Q$60)","v":"BYE"},null,{"$f":"IF($C$50=$C$51,\" \",IF($C$50<$C$51,$B$50,$B$51))","v":" "},null,{"$f":"IF($E$50=$E$51,\" \",IF($E$51>$E$50,$D$50,$D$51))","v":" "},null,{"$f":"IF($G$66=$G$67,\" \",IF($G$66>$G$67,$F$66,$F$67))","v":" "},null,{"$f":"IF($I$58=$I$59,\" \",IF($I$58<$I$59,$H$58,$H$59))","v":" "},null,{"$f":"IF($K$58=$K$59,\" \",IF($K$58<$K$59,$J$58,$J$59))","v":" "},null,{"$f":"IF(M60=M61,\" \",IF(M60>M61,55,56))","v":" "},null,55]
[10,{"$f":"IF(ISBLANK($Q$15),\"BYE\",$Q$15)","v":"BYE"},null,{"$f":"IF($C$52=$C$53,\" \",IF($C$52<$C$53,$B$52,$B$53))","v":" "},null,{"$f":"IF($E$52=$E$53,\" \",IF($E$53>$E$52,$D$52,$D$53))","v":" "},null,{"$f":"IF($G$68=$G$69,\" \",IF($G$68>$G$69,$F$68,$F$69))","v":" "},null,{"$f":"IF($I$60=$I$61,\" \",IF($I$60<$I$61,$H$60,$H$61))","v":" "},null,{"$f":"IF($K$60=$K$61,\" \",IF($K$60<$K$61,$J$60,$J$61))","v":" "},null,{"$f":"IF(M60=M61,\" \",IF(M60<M61,55,56))","v":" "},null,56]
[15,{"$f":"IF(ISBLANK($Q$20),\"BYE\",$Q$20)","v":"BYE"},null,{"$f":"IF($C$54=$C$55,\" \",IF($C$54<$C$55,$B$54,$B$55))","v":" "},null,{"$f":"IF($E$54=$E$55,\" \",IF($E$54<$E$55,$D$54,$D$55))","v":" "},null,{"$f":"IF($G$54=$G$55,\" \",IF($G$54<$G$55,$F$54,$F$55))","v":" "},null,{"$f":"IF($I$62=$I$63,\" \",IF($I$62>$I$63,$H$62,$H$63))","v":" "},null,{"$f":"IF($K$62=$K$63,\" \",IF($K$62>$K$63,$J$62,$J$63))","v":" "},null,{"$f":"IF(M62=M63,\" \",IF(M62>M63,57,58))","v":" "},null,57]
[50,{"$f":"IF(ISBLANK($Q$55),\"BYE\",$Q$55)","v":"BYE"},null,{"$f":"IF($C$56=$C$57,\" \",IF($C$56<$C$57,$B$56,$B$57))","v":" "},null,{"$f":"IF($E$56=$E$57,\" \",IF($E$56<$E$57,$D$56,$D$57))","v":" "},null,{"$f":"IF($G$56=$G$57,\" \",IF($G$56<$G$57,$F$56,$F$57))","v":" "},null,{"$f":"IF($I$64=$I$65,\" \",IF($I$64>$I$65,$H$64,$H$65))","v":" "},null,{"$f":"IF($K$64=$K$65,\" \",IF($K$64>$K$65,$J$64,$J$65))","v":" "},null,{"$f":"IF(M62=M63,\" \",IF(M62<M63,57,58))","v":" "},null,58]
[47,{"$f":"IF(ISBLANK($Q$52),\"BYE\",$Q$52)","v":"BYE"},null,{"$f":"IF($C$58=$C$59,\" \",IF($C$58<$C$59,$B$58,$B$59))","v":" "},null,{"$f":"IF($E$58=$E$59,\" \",IF($E$58<$E$59,$D$58,$D$59))","v":" "},null,{"$f":"IF($G$58=$G$59,\" \",IF($G$58<$G$59,$F$58,$F$59))","v":" "},null,{"$f":"IF($I$66=$I$67,\" \",IF($I$66>$I$67,$H$66,$H$67))","v":" "},null,{"$f":"IF($K$62=$K$63,\" \",IF($K$62<$K$63,$J$62,$J$63))","v":" "},null,{"$f":"IF(M64=M65,\" \",IF(M64>M65,59,60))","v":" "},null,59]
[18,{"$f":"IF(ISBLANK($Q$23),\"BYE\",$Q$23)","v":"BYE"},null,{"$f":"IF($C$60=$C$61,\" \",IF($C$60<$C$61,$B$60,$B$61))","v":" "},null,{"$f":"IF($E$60=$E$61,\" \",IF($E$60<$E$61,$D$60,$D$61))","v":" "},null,{"$f":"IF($G$60=$G$61,\" \",IF($G$60<$G$61,$F$60,$F$61))","v":" "},null,{"$f":"IF($I$68=$I$69,\" \",IF($I$68>$I$69,$H$68,$H$69))","v":" "},null,{"$f":"IF($K$64=$K$65,\" \",IF($K$64<$K$65,$J$64,$J$65))","v":" "},null,{"$f":"IF(M64=M65,\" \",IF(M64<M65,59,60))","v":" "},null,60]
[31,{"$f":"IF(ISBLANK($Q$36),\"BYE\",$Q$36)","v":"BYE"},null,{"$f":"IF($C$62=$C$63,\" \",IF($C$62<$C$63,$B$62,$B$63))","v":" "},null,{"$f":"IF($E$62=$E$63,\" \",IF($E$62<$E$63,$D$62,$D$63))","v":" "},null,{"$f":"IF($G$62=$G$63,\" \",IF($G$62<$G$63,$F$62,$F$63))","v":" "},null,{"$f":"IF($I$62=$I$63,\" \",IF($I$62<$I$63,$H$62,$H$63))","v":" "},null,{"$f":"IF($K$66=$K$67,\" \",IF($K$66>$K$67,$J$66,$J$67))","v":" "},null,{"$f":"IF(M66=M67,\" \",IF(M66>M67,61,62))","v":" "},null,61]
[34,{"$f":"IF(ISBLANK($Q$39),\"BYE\",$Q$39)","v":"BYE"},null,{"$f":"IF($C$64=$C$65,\" \",IF($C$64<$C$65,$B$64,$B$65))","v":" "},null,{"$f":"IF($E$64=$E$65,\" \",IF($E$64<$E$65,$D$64,$D$65))","v":" "},null,{"$f":"IF($G$64=$G$65,\" \",IF($G$64<$G$65,$F$64,$F$65))","v":" "},null,{"$f":"IF($I$64=$I$65,\" \",IF($I$64<$I$65,$H$64,$H$65))","v":" "},null,{"$f":"IF($K$68=$K$69,\" \",IF($K$68>$K$69,$J$68,$J$69))","v":" "},null,{"$f":"IF(M66=M67,\" \",IF(M66<M67,61,62))","v":" "},null,62]
[63,{"$f":"IF(ISBLANK($Q$68),\"BYE\",$Q$68)","v":"BYE"},null,{"$f":"IF($C$66=$C$67,\" \",IF($C$66<$C$67,$B$66,$B$67))","v":" "},null,{"$f":"IF($E$66=$E$67,\" \",IF($E$66<$E$67,$D$66,$D$67))","v":" "},null,{"$f":"IF($G$66=$G$67,\" \",IF($G$66<$G$67,$F$66,$F$67))","v":" "},null,{"$f":"IF($I$66=$I$67,\" \",IF($I$66<$I$67,$H$66,$H$67))","v":" "},null,{"$f":"IF($K$66=$K$67,\" \",IF($K$66<$K$67,$J$66,$J$67))","v":" "},null,{"$f":"IF(M68=M69,\" \",IF(M68>M69,63,64))","v":" "},null,63]
[2,{"$f":"IF(ISBLANK($Q$7),\"BYE\",$Q$7)","v":"BYE"},null,{"$f":"IF($C$68=$C$69,\" \",IF($C$68<$C$69,$B$68,$B$69))","v":" "},null,{"$f":"IF($E$68=$E$69,\" \",IF($E$68<$E$69,$D$68,$D$69))","v":" "},null,{"$f":"IF($G$68=$G$69,\" \",IF($G$68<$G$69,$F$68,$F$69))","v":" "},null,{"$f":"IF($I$68=$I$69,\" \",IF($I$68<$I$69,$H$68,$H$69))","v":" "},null,{"$f":"IF($K$68=$K$69,\" \",IF($K$68<$K$69,$J$68,$J$69))","v":" "},null,{"$f":"IF(M68=M69,\" \",IF(M68<M69,63,642))","v":" "},null,64]

{"sheet":"Skupina_4","index":15,"n_rows":19,"n_cols":28,"rows_kept":19,"merged":[[1,1,1,21],[3,2,3,4],[3,5,3,7],[3,8,3,10],[3,11,3,13],[3,14,3,16],[3,17,3,19],[4,2,4,4],[5,5,5,7],[6,8,6,10],[7,11,7,13],[11,1,11,14],[13,1,13,4],[13,8,13,14],[14,1,14,4],[14,8,14,14],[15,1,15,4],[15,8,15,14],[16,1,16,4],[16,8,16,14],[17,1,17,4],[17,8,17,14],[18,1,18,4],[18,8,18,14],[19,1,19,4],[19,8,19,14],[20,1,20,4],[20,8,20,14],[21,1,21,4],[21,8,21,14],[22,1,22,4],[22,8,22,14]]}
[]
[null,{"$f":"B1","v":0}]
[]
[null,null,"Varga.F",null,null,"Varga.D",null,null,"Zahradníček",null,null,"Jelínek",{"$nulls":5},"Skóre",null,null,"Body","Poradie"]
[null,"Varga.F",{"$f":"B1","v":0},null,null,2,{"$f":"IF(ISBLANK(F5),\" \",\":\")","v":":"},1,2,{"$f":"IF(ISBLANK(I5),\" \",\":\")","v":":"},0,2,{"$f":"IF(ISBLANK(L5),\" \",\":\")","v":":"},0,null,{"$f":"IF(ISBLANK(O5),\" \",\":\")","v":" "},{"$nulls":5},1,null,null,{"$f":"IF(F5>H5,1,0)","v":1},{"$f":"IF(I5>K5,1,0)","v":1},{"$f":"IF(L5>N5,1,0)","v":1},{"$f":"IF(O5>Q5,1,0)","v":0}]
[null,{"$f":"F4","v":"Varga.D"},{"$f":"IF(ISBLANK(H5),0,H5)","v":1},{"$f":"IF(ISBLANK(C6),\" \",\":\")","v":":"},{"$f":"IF(ISBLANK(F5),0,F5)","v":2},{"$f":"C5","v":0},null,null,2,{"$f":"IF(ISBLANK(I6),\" \",\":\")","v":":"},0,2,{"$f":"IF(ISBLANK(L6),\" \",\":\")","v":":"},0,null,{"$f":"IF(ISBLANK(O6),\" \",\":\")","v":" "},{"$nulls":5},2,null,{"$f":"IF(C6>E6,1,0)","v":0},null,{"$f":"IF(I6>K6,1,0)","v":1},{"$f":"IF(L6>N6,1,0)","v":1},{"$f":"IF(O6>Q6,1,0)","v":0}]
[null,"Záhradníček",{"$f":"IF(ISBLANK(K5),0,K5)","v":0},{"$f":"IF(ISBLANK(C7),\" \",\":\")","v":":"},{"$f":"IF(ISBLANK(I5),0,I5)","v":2},{"$f":"IF(ISBLANK(K6),0,K6)","v":0},{"$f":"IF(ISBLANK(F7),\" \",\":\")","v":":"},{"$f":"IF(ISBLANK(I6),0,I6)","v":2},{"$f":"C5","v":0},null,null,0,{"$f":"IF(ISBLANK(L7),\" \",\":\")","v":":"},2,null,{"$f":"IF(ISBLANK(O7),\" \",\":\")","v":" "},{"$nulls":5},4,null,{"$f":"IF(C7>E7,1,0)","v":0},{"$f":"IF(F7>H7,1,0)","v":0},null,{"$f":"IF(L7>N7,1,0)","v":0},{"$f":"IF(O7>Q7,1,0)","v":0}]
[null,"Jelínek",{"$f":"IF(ISBLANK(K6),0,K6)","v":0},{"$f":"IF(ISBLANK(C8),\" \",\":\")","v":":"},{"$f":"IF(ISBLANK(I6),0,I6)","v":2},{"$f":"IF(ISBLANK(N6),0,N6)","v":0},{"$f":"IF(ISBLANK(F8),\" \",\":\")","v":":"},{"$f":"IF(ISBLANK(L6),0,L6)","v":2},{"$f":"IF(ISBLANK(N7),0,N7)","v":2},{"$f":"IF(ISBLANK(I8),\" \",\":\")","v":":"},{"$f":"IF(ISBLANK(L7),0,L7)","v":0},{"$f":"C5","v":0},{"$nulls":3},{"$f":"IF(ISBLANK(O8),\" \",\":\")","v":" "},{"$nulls":5},3,null,{"$f":"IF(C8>E8,1,0)","v":0},{"$f":"IF(F8>H8,1,0)","v":0},{"$f":"IF(I8>K8,1,0)","v":1},null,{"$f":"IF(O8>Q8,1,0)","v":0}]
[]
[]
[]
[null,"Poradie zápasov"]
[]
[null,{"$f":"C4","v":"Varga.F"},{"$nulls":3},"-",null,null,{"$f":"F4","v":"Varga.D"}]
[null,{"$f":"I4","v":"Zahradníček"},{"$nulls":3},"-",null,null,{"$f":"L4","v":"Jelínek"}]
[null,{"$f":"C4","v":"Varga.F"},{"$nulls":3},"-",null,null,{"$f":"L4","v":"Jelínek"}]
[null,{"$f":"F4","v":"Varga.D"},{"$nulls":3},"-",null,null,{"$f":"I4","v":"Zahradníček"}]
[null,{"$f":"F4","v":"Varga.D"},{"$nulls":3},"-",null,null,{"$f":"L4","v":"Jelínek"}]
[null,{"$f":"C4","v":"Varga.F"},{"$nulls":3},"-",null,null,{"$f":"I4","v":"Zahradníček"}]